program: Gaussian 09
title: 000102993
version: EM64L-G09RevD.01
frameworkgroup: C1[X(C5H10O2)]
method: RPBEPBE
basis: SDD
operation: Freq
keyword: #pfreq=noraman
keyword: PBEPBE/SDD
title: #p freq=noraman PBEPBE/SDD
converged: YES YES NO NO
title: Mulliken charges:
elementType: O O C C C C C H H H H H H H H H H
charge: -0.284395 -0.259479 -0.025919 -0.340051 0.075161 -0.689573 -0.677693 0.227246 0.198050 0.232604 0.191972 0.219911 0.239560 0.209782 0.223281 0.220781 0.238762
chargesum: 0.00000
title: Mulliken charges with hydrogens summed into heavy atoms:
elementType: O O C C C C C
charge: -0.284395 -0.259479 0.201327 0.090603 0.267133 -0.020320 0.005132
polarizability: 7.23347418e+01 2.77142503e+00 5.51483962e+01 -1.98719250e+00 -6.13889695e-01 5.05435833e+01
1716.lowfreq: -19.9899 -8.1737 -0.0008 -0.0007 -0.0003 16.3642 39.7133 174.8229 193.4550
frequency: 37.8615 174.7850 193.4528 219.1317 259.7856 361.8464 416.5483 489.4250 615.2823 643.8965 760.3153 790.1607 839.9063 891.2767 931.5664 976.3923 1054.2251 1074.5801 1076.5264 1120.1156 1132.8855 1153.9386 1197.9013 1277.9929 1305.9852 1313.6851 1348.8504 1367.7502 1388.5862 1395.7375 1458.1693 1458.3607 1463.8688 1469.8605 1478.4185 2920.9044 2960.8998 2981.9088 3007.0551 3014.8941 3076.1771 3096.1227 3102.3253 3108.3708 3120.2036
redmass: 3.3781 2.2714 1.1147 1.1434 2.1692 2.6403 2.5471 2.9201 3.5129 6.4443 3.4491 3.0953 2.9234 2.2931 1.3392 5.9048 2.5280 1.6192 2.0002 2.1399 1.9359 2.2630 1.2454 1.1646 1.2074 1.2525 1.3625 1.3680 1.2331 1.3945 1.0491 1.0465 1.0471 1.0694 1.0688 1.0847 1.0685 1.0370 1.0357 1.0867 1.0981 1.0987 1.0988 1.0995 1.1008
irintensity: 2.2703 7.8203 0.3866 0.9273 4.0111 3.4243 3.2523 8.9775 0.2637 2.8788 25.5781 31.5306 22.3252 22.1799 3.1535 55.7845 48.8437 27.0596 69.8267 9.3516 14.9828 21.0336 7.6739 3.0982 5.5739 4.9635 7.5902 9.1516 25.5784 50.9209 10.5419 6.4369 9.9638 9.3011 8.1583 87.2718 63.3838 27.6327 13.1102 30.5902 31.2414 22.8008 40.3014 18.3262 24.1997
temp: 298.150 k
press: 1.00000 atm
elementType: 8 8 6 6 6 6 6 1 1 1 1 1 1 1 1 1 1
symmnumber: 1
zpe: 379981.4 jmol-1
zpe.correction: 0.144727 hartree
zpe.thermalcorrener: 0.152406 hartree
zpe.thermalcorrenthalpy: 0.153350 hartree
zpe.thermalcorrgfe: 0.112538 hartree
zpe.sumelectzpe: -346.374977 hartree
zpe.sumelectthermal: -346.367299 hartree
zpe.sumelectthermalent: -346.366354 hartree
zpe.sumelectthermalfe: -346.407166 hartree
dipole: 1.5033 0.3787 0.6893
dipole: 1.6966
quadrupole: -38.5910 -46.9127 -41.8167
quadrupole: 3.5879 -1.5742 -0.8682
quadrupole: 3.8492 -4.4726 0.6234 3.5879 -1.5742 -0.8682
hfenergy: -346.5197042 hartree
pointgroup: C01 [X(C5H10O2)]
dipole: -0.577461 -0.1816967 0.281204 debye
dipolederiv: -1.0683392 0.0967089 -0.1435355 -0.0594131 -0.5217378 -0.0021396 -0.2035943 0.0007345 -0.4411858 -0.7478026 -0.1603047 -0.0203845 -0.0954203 -0.7346785 -0.0078174 -0.1226385 -0.0280943 -0.4187615 0.6686801 -0.0096412 0.0474347 0.2187994 0.1962772 0.1032075 0.0436046 0.1071724 0.346508 0.4437944 0.1857966 -0.0454207 0.0310971 0.1693773 -0.0045676 -0.0403566 -0.0538453 0.3541928 0.9662058 0.0365494 0.1344533 0.0058923 0.8042128 -0.027725 0.2600115 0.0277434 0.6863784 -0.1258675 0.0445862 0.0763349 0.0687929 0.0297578 -0.0358026 0.0980282 -0.0223669 -0.0050676 -0.2028297 -0.0920976 0.0498803 -0.0812578 0.0061277 0.0147885 0.0726117 0.0277782 0.005408 -0.0357239 -0.0024622 -0.0255465 -0.0238884 0.0348645 -0.0084833 -0.0743376 -0.0151751 -0.1792575 -0.0574363 -0.0531104 0.0617354 -0.0108106 0.0490765 0.0167992 0.1246309 0.097122 -0.1575434 0.0412997 -0.0529977 -0.0231232 -0.0668984 -0.0400914 -0.0742393 -0.0413978 -0.1196774 0.0154444 -0.0506926 0.0057632 0.0594021 -0.0118849 -0.0351525 0.0166581 -0.0560222 -0.0303692 -0.2706977 0.063124 0.0049919 -0.0778912 0.0164817 0.0925518 0.0172479 -0.0149035 -0.0092097 -0.1387529 0.0665507 0.055328 -0.0035475 0.1060034 -0.0971382 0.0513389 -0.0032949 0.0664512 0.0781215 -0.0908887 -0.1000675 -0.0182374 -0.1419254 -0.0027182 -0.033678 -0.0170627 -0.0416979 0.0869057 0.0879641 -0.0123273 0.0023398 -0.0609993 -0.1028161 -0.0599581 0.0044032 -0.0664664 0.0897796 -0.0507909 0.0636909 -0.0617938 0.1077666 0.0430394 0.0644186 -0.072715 0.0673944 0.058179 0.0927528 -0.0104066 -0.0121004 -0.0023352 0.1090477 -0.0300479 0.043033 -0.0074938 -0.1096511 unknown
polarizability: 72.0968851|3.5915243|55.4418638|1.5406293|0.7020821|50.4879723 unknown
InChI: InChI=1S/C5H10O2/c1-4-3-6-5(2)7-4/h4-5H,3H2,1-2H3
charge 0 multiplicity 1
17 atoms
O  -0.027264 1.008479 -0.383983
O  0.825846 -1.166488 -0.195691
C  -1.186183 0.087646 -0.59539
C  -0.641985 -1.306893 -0.159489
C  1.055862 0.21718 0.240077
C  -2.405938 0.559585 0.201595
C  2.410671 0.703572 -0.234869
H  -1.397573 0.109507 -1.680506
H  -0.981847 -1.554513 0.868577
H  -0.906586 -2.122007 -0.850052
H  0.941546 0.27251 1.347552
H  -2.183123 0.578854 1.283589
H  -2.701079 1.576569 -0.107743
H  -3.266879 -0.115439 0.031782
H  2.549351 1.761179 0.046495
H  3.212844 0.104068 0.228656
H  2.475036 0.611691 -1.331101
