program: Gaussian 09
title: 000103067
version: EM64L-G09RevD.01
frameworkgroup: C1[X(C16H13N3O9S3)]
method: RPBEPBE
basis: SDD
operation: Freq
keyword: #p
keyword: freq=noraman
keyword: PBEPBE/SDD
title: #p freq=noraman PBEPBE/SDD
converged: YES YES NO NO
title: Mulliken charges:
elementType: S S S O O O O O O O O O N N N C C C C C C C C C C C C C C C C H H H H H H H H H H H H H
charge: 0.987056 1.003036 0.991906 -0.564487 -0.555061 -0.507939 -0.493024 -0.564486 -0.508087 -0.488163 -0.494405 -0.493282 -0.085299 -0.094979 -0.661737 0.326928 0.282327 -0.080999 -0.342539 0.326369 -0.107081 -0.367987 -0.252552 -0.265974 -0.252651 -0.440094 0.310905 -0.012661 -0.284025 -0.211688 -0.238992 0.253877 0.292139 0.287075 0.312573 0.235184 0.320045 0.308753 0.296517 0.342848 0.336908 0.385600 0.381293 0.386854
chargesum: 0.00000
title: Mulliken charges with hydrogens summed into heavy atoms:
elementType: S S S O O O O O O O O O N N N C C C C C C C C C C C C C C C C
charge: 0.987056 1.003036 0.991906 -0.178887 -0.173768 -0.507939 -0.493024 -0.177632 -0.508087 -0.488163 -0.494405 -0.493282 -0.085299 -0.094979 0.018020 0.326928 0.282327 -0.080999 -0.088662 0.326369 -0.107081 -0.075848 0.034523 0.046599 -0.252651 -0.204910 0.310905 -0.012661 0.036020 0.097065 0.057526
polarizability: 6.50759363e+02 -4.70487154e+01 4.04478591e+02 -6.92376485e+00 8.53951696e+00 1.69119926e+02
1716.lowfreq: -4.2647 -1.9944 -0.0019 -0.0007 0.0009 1.9724 9.7939 21.1040 23.2683
frequency: 9.4538 21.0911 23.2673 27.5034 37.3031 43.0973 52.2177 70.6189 73.4250 84.3174 100.9662 109.6179 115.8715 120.8561 126.7272 157.8025 160.2611 162.3253 178.9932 180.7599 188.3848 194.8882 212.5388 219.6942 243.4698 247.7361 275.1988 282.5246 283.2615 294.3826 305.6088 309.7935 323.4851 335.4376 352.3658 364.2831 364.6626 376.1690 379.3216 397.5959 408.4774 419.0031 445.2750 449.6726 474.3262 483.0350 499.2762 507.4677 512.5515 536.8489 538.1744 551.4617 558.3196 575.9272 591.9306 604.8152 632.1774 641.5487 678.5875 683.0430 719.8778 750.2295 790.3552 801.3080 814.3229 833.0814 835.2477 840.7273 844.5444 854.3734 860.7443 896.8894 898.6971 940.1740 953.8780 965.0312 967.9151 980.4152 985.1257 989.6494 1005.5266 1006.8887 1040.7019 1044.3226 1051.7412 1054.2838 1054.9212 1074.9442 1115.8260 1131.8487 1155.2285 1182.5023 1188.9841 1217.5431 1245.2327 1282.9713 1324.2526 1336.4065 1350.2284 1369.5860 1383.2464 1421.1412 1425.1330 1430.7873 1445.2500 1473.6177 1530.6649 1534.4660 1546.9570 1596.5097 1602.7743 1612.9503 1658.5235 3133.3532 3140.1063 3155.6818 3161.1541 3165.7369 3166.6168 3178.7797 3187.0097 3479.5460 3480.0525 3480.9204 3551.3299 3685.5572
redmass: 8.3399 9.7428 11.6817 9.7567 7.5740 9.9335 7.4745 5.9883 9.1021 6.7423 1.7485 3.4234 3.3221 5.8341 6.9310 7.3754 5.8369 3.1994 3.4878 3.4985 2.2601 6.0007 3.6680 7.6404 3.8222 7.0345 4.4492 5.1531 7.0438 9.2753 5.2058 7.6910 10.7624 10.2786 8.2851 7.0386 5.6547 5.9543 5.2837 1.5946 11.2459 9.9891 8.7660 1.6158 3.5811 7.2509 5.9700 5.1633 3.8782 2.1484 4.6353 13.1462 4.2621 7.1180 6.0758 4.5401 3.8343 7.1323 4.5205 6.0673 6.1485 3.9015 7.4915 2.6217 6.7995 12.5693 8.2526 7.0599 1.5211 1.4978 1.6361 6.6393 1.7803 1.5411 12.1072 12.9327 11.6589 3.7508 1.5557 1.9794 1.3495 1.3881 3.8195 1.4366 1.2088 1.5404 1.1869 2.5423 1.8832 1.5614 1.3424 2.5818 1.4576 1.4716 1.7909 2.0248 3.4020 4.0315 3.6464 3.8445 3.2812 7.2071 3.3701 4.4002 3.1325 3.8066 5.3854 6.2594 5.9649 6.6007 8.4669 6.9454 1.2199 1.0890 1.0914 1.0967 1.0894 1.0906 1.0902 1.0971 1.0965 1.0662 1.0662 1.0662 1.0460 1.1032
irintensity: 1.5952 1.2553 0.3110 1.4179 1.6764 0.6479 1.0155 2.1079 0.1530 1.4464 59.1041 11.0037 17.6562 2.1370 1.6840 6.5577 10.1029 7.0661 30.6411 23.0695 16.7646 7.2056 13.6159 6.1940 57.4561 2.4918 32.8822 41.0331 22.8820 36.0991 50.2702 9.3091 19.1886 43.0926 1.1226 35.4834 15.3363 8.3783 11.6019 0.5100 88.6272 55.1769 67.7545 12.6879 7.6300 26.4573 10.0900 18.4392 95.2550 32.9798 154.7775 127.7013 142.4198 175.0554 16.6082 21.6466 15.5268 22.6178 10.5616 2.7541 3.3865 0.7833 12.6749 0.4465 52.1065 67.5112 100.7812 84.4250 15.3239 90.4376 6.4630 18.9120 11.9428 16.4841 99.3065 74.6123 24.9710 42.5474 6.8775 3.0594 1.3186 0.3220 1.6684 32.2779 78.0863 65.4396 71.5061 89.9114 24.6332 16.0491 57.3482 100.0347 220.6616 0.3554 82.1980 149.9172 931.7703 69.2625 92.8585 8.3202 58.8881 3.2241 39.0103 19.9225 11.0584 45.6762 93.7510 4.5701 21.4854 392.2019 2.9526 42.4312 394.0334 13.5358 4.9742 13.6479 13.0071 12.9577 0.3439 15.9923 0.0840 39.1551 52.5395 60.1681 278.4057 32.7349
temp: 298.150 k
press: 1.00000 atm
elementType: 16 16 16 8 8 8 8 8 8 8 8 8 7 7 7 6 6 6 6 6 6 6 6 6 6 6 6 6 6 6 6 1 1 1 1 1 1 1 1 1 1 1 1 1
symmnumber: 1
zpe: 729623.9 jmol-1
zpe.correction: 0.277899 hartree
zpe.thermalcorrener: 0.310172 hartree
zpe.thermalcorrenthalpy: 0.311116 hartree
zpe.thermalcorrgfe: 0.210911 hartree
zpe.sumelectzpe: -2650.155374 hartree
zpe.sumelectthermal: -2650.123102 hartree
zpe.sumelectthermalent: -2650.122158 hartree
zpe.sumelectthermalfe: -2650.222363 hartree
dipole: 4.0274 -5.3487 3.2311
dipole: 7.4343
quadrupole: -217.9762 -189.6052 -209.3438
quadrupole: -34.2045 -0.1505 11.6043
quadrupole: -12.3344 16.0365 -3.7021 -34.2045 -0.1505 11.6043
hfenergy: -2650.4332736 hartree
pointgroup: C01 [X(C16H13N3O9S3)]
dipole: -1.7481861 -1.9730123 -1.2672386 debye
polarizability: 655.6062281|29.8128883|399.3904279|-15.9771648|-5.361651|169.3612239 unknown
InChI: InChI=1S/C16H13N3O9S3/c17-13-4-5-14(11-3-1-9(7-12(11)13)29(20,21)22)18-19-15-8-10(30(23,24)25)2-6-16(15)31(26,27)28/h1-8,20,23,26H,17H2
charge 0 multiplicity 1
44 atoms
S  -6.122888 1.994266 0.018792
S  3.745016 -3.086083 -0.309403
S  4.189963 3.381456 0.178594
O  -6.217174 2.184443 -1.826601
O  3.104379 -3.092721 -2.050553
O  -7.314032 1.012007 0.50826
O  -5.942472 3.464521 0.667565
O  4.27384 3.683242 -1.651533
O  5.281789 -3.599509 -0.323568
O  2.705346 -3.848865 0.662939
O  2.814419 4.003509 0.756924
O  5.615984 3.77203 0.83383
N  0.314897 -0.423597 0.010743
N  1.400339 -1.166243 -0.056208
N  -4.571726 -3.23819 0.394472
C  -3.380881 -1.087946 0.169479
C  -2.116415 -0.391273 0.074292
C  -0.882336 -1.151166 0.090283
C  -4.590311 -0.329939 0.137171
C  -3.390374 -2.53864 0.291269
C  -4.510337 1.051277 0.029103
C  -2.108613 1.037674 -0.030712
C  -3.295128 1.773119 -0.055544
C  -0.932451 -2.567144 0.208465
C  3.814735 -1.19729 -0.170531
C  -2.154103 -3.242428 0.309579
C  2.616185 -0.447598 -0.068484
C  4.033282 1.5073 0.01914
C  2.748708 0.970415 0.02888
C  5.100514 -0.6392 -0.177812
C  5.224537 0.763943 -0.076301
H  -5.58331 -0.786829 0.207961
H  -1.141037 1.540722 -0.093425
H  -3.296528 2.864736 -0.121414
H  0.01571 -3.115173 0.234687
H  -2.164919 -4.333645 0.411938
H  1.850476 1.588591 0.121068
H  5.976529 -1.289813 -0.260982
H  6.201143 1.255575 -0.059207
H  -5.479773 -2.781275 0.400757
H  -4.557836 -4.2525 0.478915
H  -6.958228 2.82815 -2.026502
H  3.025348 -4.049759 -2.335656
H  4.406331 4.665752 -1.794469
