program: Gaussian 09
title: 000102992
version: EM64L-G09RevD.01
frameworkgroup: C1[X(C11H16O3)]
method: RPBEPBE
basis: SDD
operation: Freq
keyword: #pfreq=noraman
keyword: PBEPBE/SDD
title: #p freq=noraman PBEPBE/SDD
converged: NO YES NO NO
title: Mulliken charges:
elementType: O O O C C C C C C C C C C C H H H H H H H H H H H H H H H H
charge: -0.310665 -0.236385 -0.231109 0.365995 -0.094371 -0.085438 -0.468140 -0.502423 -0.445493 -0.434201 -0.441659 -0.054765 -0.053600 -0.566778 0.221138 0.222941 0.242492 0.232950 0.237585 0.204566 0.208982 0.225659 0.195979 0.244949 0.245195 0.191347 0.194487 0.250235 0.223791 0.216735
chargesum: 0.00000
title: Mulliken charges with hydrogens summed into heavy atoms:
elementType: O O O C C C C C C C C C C C
charge: -0.310665 -0.236385 -0.231109 0.365995 0.126767 0.137503 0.007302 -0.060272 -0.010852 0.006728 -0.005117 0.139722 0.196635 -0.126251
polarizability: 1.57744367e+02 2.88839323e+00 1.06880211e+02 1.02392893e+00 -2.97204615e+00 9.58493175e+01
1716.lowfreq: -16.8493 -10.7473 0.0006 0.0009 0.0009 6.6937 44.1065 56.7629 71.8376
frequency: 44.0095 56.6541 71.8189 147.7165 166.6891 200.2343 232.3080 267.0342 283.1162 332.6815 342.8313 380.8385 395.6836 416.8679 458.9854 473.9386 541.5362 550.7130 605.5959 647.1471 655.9992 703.7023 743.2818 781.7006 846.0861 865.8618 871.4155 893.4205 910.1431 918.9747 932.3219 943.8927 961.8525 966.5597 985.8988 1003.3275 1019.7365 1025.7445 1036.9301 1054.0631 1094.9126 1124.2135 1144.8365 1153.4892 1181.0157 1203.5670 1208.3778 1225.3368 1243.4624 1270.7101 1278.9599 1295.7098 1309.1553 1324.0828 1335.2353 1338.2186 1342.6372 1351.2813 1362.2191 1368.0475 1411.4369 1440.2029 1451.0743 1452.2756 1456.4090 1465.0244 1470.3520 1672.9687 2893.9238 2920.3375 2932.2217 2976.7488 2985.0322 2996.1324 3029.7823 3045.5145 3055.0564 3071.7932 3079.2457 3081.5899 3095.0363 3100.3842 3137.0522 3205.0493
redmass: 2.8601 4.3090 3.4221 3.3018 4.6869 4.1752 2.6532 2.7107 2.1945 2.1266 3.4150 2.3623 2.3605 2.2251 3.7699 4.4750 4.1735 5.2125 5.4943 2.4899 2.5842 3.2989 3.5063 2.8527 2.9722 2.5612 2.8312 3.0979 2.3900 2.2721 1.8107 6.5382 1.2912 2.2973 2.1520 1.1918 1.9215 2.3489 1.5861 1.6277 1.5395 2.2932 1.9431 1.9395 1.5953 1.4158 1.1049 1.3015 1.2307 1.3060 1.4910 1.5371 1.1422 1.4923 1.5123 1.2796 1.4938 1.5026 1.5539 1.3429 2.6778 1.2396 1.1012 1.0817 1.0960 1.0945 1.0948 4.9331 1.0841 1.0681 1.0688 1.0601 1.0627 1.0622 1.0985 1.1012 1.0982 1.0947 1.0875 1.0942 1.0615 1.0937 1.0942 1.1141
irintensity: 0.1396 0.1809 1.5142 3.1059 3.8423 3.7009 7.1992 6.2449 1.4331 1.6447 0.7800 14.7372 1.5173 1.5656 3.3605 4.4170 2.2363 1.3393 13.6624 1.3978 1.0883 2.0548 5.6900 27.0928 2.8112 21.6772 43.5413 81.9393 7.0915 21.2074 4.6700 22.3756 80.1399 1.6017 15.6009 10.5517 40.2745 108.9182 40.7537 48.1917 4.3321 29.6423 4.4015 4.2548 8.5558 0.8247 3.0790 8.2305 0.8138 0.1654 2.3695 8.5175 3.7589 26.7519 3.3516 1.2160 4.1495 0.2986 1.3297 6.9185 5.1097 39.2083 22.3792 5.4322 10.5736 3.4433 12.2986 1.6978 56.1252 28.4952 97.2380 25.9223 51.6294 12.6727 24.2363 31.5062 3.5949 31.5603 27.7380 24.0165 9.6154 62.8367 3.0575 22.6280
temp: 298.150 k
press: 1.00000 atm
elementType: 8 8 8 6 6 6 6 6 6 6 6 6 6 6 1 1 1 1 1 1 1 1 1 1 1 1 1 1 1 1
symmnumber: 1
zpe: 659844.7 jmol-1
zpe.correction: 0.251322 hartree
zpe.thermalcorrener: 0.264192 hartree
zpe.thermalcorrenthalpy: 0.265136 hartree
zpe.thermalcorrgfe: 0.211951 hartree
zpe.sumelectzpe: -653.260720 hartree
zpe.sumelectthermal: -653.247850 hartree
zpe.sumelectthermalent: -653.246906 hartree
zpe.sumelectthermalfe: -653.300091 hartree
dipole: -0.4527 2.2977 -1.8225
dipole: 2.9674
quadrupole: -88.5846 -78.2768 -87.7341
quadrupole: 1.8698 -5.4747 0.4379
quadrupole: -3.7194 6.5884 -2.8689 1.8698 -5.4747 0.4379
hfenergy: -653.5120416 hartree
pointgroup: C01 [X(C11H16O3)]
dipole: 0.1777208 0.6722157 0.9378497 debye
polarizability: 157.7303133|-3.1804966|104.4949891|0.3186189|5.4281878|98.2485931 unknown
InChI: InChI=1S/C11H16O3/c1-2-10-12-6-11(7-13-10)4-3-8-9(5-11)14-8/h2,8-10H,1,3-7H2
charge 0 multiplicity 1
30 atoms
O  -3.538119 -0.662624 -0.873596
O  1.463975 -0.570137 0.986177
O  1.789639 0.422205 -1.190217
C  -0.489322 0.517479 -0.14678
C  -2.29189 -1.332223 -0.303434
C  -3.181634 -0.512537 0.588499
C  -0.962502 -0.803016 -0.822668
C  -1.68306 1.482469 0.088835
C  -2.764746 0.883246 1.019179
C  0.219918 0.199466 1.200015
C  0.560184 1.22914 -1.038436
C  2.391747 0.175986 0.123863
C  3.620159 -0.663276 -0.073693
C  4.858263 -0.279366 0.314611
H  -2.397661 -2.424646 -0.265632
H  -3.877119 -1.038842 1.25789
H  -0.178427 -1.568288 -0.678237
H  -1.060322 -0.652709 -1.91538
H  -2.144801 1.718304 -0.889289
H  -1.318461 2.436709 0.519424
H  -2.40038 0.833808 2.065087
H  -3.655255 1.540787 1.028343
H  0.456316 1.146894 1.736703
H  -0.392978 -0.441947 1.853346
H  0.184323 1.38047 -2.063973
H  0.823201 2.219172 -0.598717
H  2.612563 1.158816 0.607885
H  3.44434 -1.628505 -0.56423
H  5.731834 -0.919921 0.15409
H  5.036813 0.685786 0.804734
