program: Gaussian 09
title: 000103045
version: EM64L-G09RevD.01
frameworkgroup: C1[X(C14H24N2O3S)]
method: RPBEPBE
basis: SDD
operation: Freq
keyword: #p
keyword: freq=noraman
keyword: PBEPBE/SDD
title: #p freq=noraman PBEPBE/SDD
converged: YES YES NO NO
title: Mulliken charges:
elementType: S O O O N N C C C C C C C C C C C C C C H H H H H H H H H H H H H H H H H H H H H H H H
charge: 1.025122 -0.578278 -0.525029 -0.526268 -0.178693 -0.707071 -0.492467 -0.049234 -0.375262 -0.304669 0.484950 -0.617722 -0.680760 -0.698622 -0.559557 -0.380855 0.328977 0.338408 -0.462006 -0.851320 0.229005 0.237934 0.200369 0.239678 0.206643 0.231055 0.234465 0.290349 0.291481 0.207719 0.221610 0.225323 0.224243 0.209927 0.241102 0.214973 0.220084 0.210761 0.224210 0.224887 0.233706 0.316773 0.300456 0.373602
chargesum: 0.00000
title: Mulliken charges with hydrogens summed into heavy atoms:
elementType: S O O O N N C C C C C C C C C C C C C C
charge: 1.025122 -0.204676 -0.525029 -0.526268 -0.178693 -0.089842 -0.025529 0.151136 0.071059 0.160850 0.484950 -0.035892 -0.026108 -0.023350 -0.344584 -0.160771 0.328977 0.338408 -0.251244 -0.168517
polarizability: 6.41999149e+02 -9.69953943e+00 2.25445563e+02 -9.12694326e+00 -1.10050330e+00 1.45236689e+02
1716.lowfreq: -14.3332 -7.5256 -5.4765 -0.0013 -0.0008 0.0011 1.7081 11.6598 17.6999
frequency: -7.5586 10.0461 17.0434 41.2597 46.1655 67.3716 85.8885 90.4767 109.8591 137.2994 153.2606 163.3059 166.5386 171.4937 173.3451 174.7672 199.2286 215.5316 234.1677 241.1022 258.1264 270.7125 284.8454 296.4982 305.3062 321.5819 328.1345 338.1801 357.5790 381.9432 416.6773 427.4893 437.1928 459.8089 500.9590 533.5342 539.8097 576.8392 583.2219 611.3496 666.7667 724.1896 752.9937 765.2236 781.2590 789.7803 823.6739 832.4357 858.1819 891.0932 894.5427 906.2001 911.7180 936.7534 944.0507 962.0923 986.5231 995.3295 1003.8330 1024.9451 1032.8195 1040.2697 1073.8241 1080.0846 1116.0822 1128.4952 1135.4110 1153.8498 1163.1873 1197.6111 1204.4846 1229.9429 1243.6779 1279.4561 1283.6741 1293.1627 1300.8875 1313.9555 1320.9570 1337.0167 1340.7744 1354.0149 1369.7809 1378.6934 1394.9328 1396.4222 1409.3779 1413.8229 1442.8343 1460.7536 1468.9693 1471.2442 1472.3721 1473.9494 1480.4256 1485.3378 1489.3939 1492.4780 1519.2495 1575.8179 1630.3264 1647.5279 2948.6149 2968.2856 2981.8840 2983.8645 2985.4395 2992.0940 2992.5572 3015.0137 3023.6226 3040.7239 3058.0223 3062.9501 3076.6412 3080.2336 3082.3658 3096.5874 3104.2601 3113.9237 3150.1859 3157.0958 3174.2197 3498.7347 3577.5434 3717.9119
redmass: 8.0834 4.7180 5.2427 3.8469 3.6855 5.6480 2.4373 2.3414 3.7953 2.5037 3.3667 2.2700 4.4102 1.4496 1.4363 1.2605 1.1149 1.7905 2.1140 1.7589 3.7643 3.0731 4.1826 3.1836 3.7832 1.8979 3.7734 1.8162 2.4352 6.7003 3.1269 3.0751 2.9600 4.1779 2.8830 9.8297 4.0721 4.3412 3.5063 3.1984 5.0743 3.4146 1.0845 4.0251 1.2961 1.5074 2.3837 10.8357 1.3976 1.7814 3.0051 1.3679 1.3497 1.3310 2.9237 2.1084 3.9604 1.8340 1.3041 1.4406 3.2907 1.5036 3.1697 1.4736 1.6916 1.9814 2.4204 2.0954 1.4467 3.0758 1.8256 1.1997 1.5151 1.4158 1.2977 1.0678 1.2536 1.7677 1.3173 1.9563 1.3676 1.2635 3.9681 1.2043 1.2559 1.2860 1.8807 1.1158 2.0800 1.0499 1.0701 1.0459 1.0507 1.0673 1.0990 1.2958 1.0856 1.1175 2.7387 6.9371 1.4509 3.0049 1.0392 1.0627 1.0681 1.0579 1.0449 1.0458 1.0565 1.0975 1.0970 1.1037 1.0560 1.1055 1.0996 1.0954 1.0994 1.0990 1.0980 1.0885 1.1109 1.0927 1.0888 1.0666 1.0447 1.1036
irintensity: 0.1289 0.0806 1.2836 0.6659 0.7206 2.6120 0.9001 0.3896 1.0370 1.1798 1.3179 7.4153 1.3906 19.6893 15.4025 7.4580 2.0014 73.8116 35.5484 147.0261 74.8353 21.2081 61.3013 49.7401 74.8082 16.1795 133.1243 58.1766 11.9283 19.7283 15.4832 1.8067 16.6059 73.6427 0.3554 383.2025 43.2495 12.1244 8.2761 13.0911 10.7392 0.3417 9.8276 7.4744 3.5087 42.3745 1.5958 155.8630 17.2314 2.4011 7.4363 1.8353 0.2385 5.0084 71.4730 19.3944 55.4475 5.7828 63.6781 19.4138 9.4282 5.0367 5.5168 12.4399 79.3325 8.4940 18.7382 33.1927 21.4116 90.4710 10.3505 3.2441 11.2892 49.8675 17.5594 1.1684 0.4625 68.8492 5.3092 57.4596 0.1913 43.9642 2.1637 25.8746 5.6627 33.7377 21.8755 6.3606 47.1351 1.7037 8.5781 8.2774 4.3894 2.4973 5.2127 10.4219 3.7026 20.9169 436.9147 18.1146 78.2386 211.7692 83.3835 25.2168 4.4613 9.2266 35.1851 46.8880 21.4363 27.6828 7.0228 5.5670 1.8965 40.1423 17.5147 13.9397 68.1669 13.1111 36.5488 31.6854 1.0512 9.1553 19.3647 118.9294 146.3227 21.6628
temp: 298.150 k
press: 1.00000 atm
elementType: 16 8 8 8 7 7 6 6 6 6 6 6 6 6 6 6 6 6 6 6 1 1 1 1 1 1 1 1 1 1 1 1 1 1 1 1 1 1 1 1 1 1 1 1
symmnumber: 1
zpe: 951986.1 jmol-1
zpe.correction: 0.362592 hartree
zpe.thermalcorrener: 0.386483 hartree
zpe.thermalcorrenthalpy: 0.387427 hartree
zpe.thermalcorrgfe: 0.307302 hartree
zpe.sumelectzpe: -1279.375873 hartree
zpe.sumelectthermal: -1279.351983 hartree
zpe.sumelectthermalent: -1279.351039 hartree
zpe.sumelectthermalfe: -1279.431163 hartree
dipole: 5.7944 0.6315 2.2011
dipole: 6.2305
quadrupole: -136.1001 -119.8443 -138.1950
quadrupole: -7.4205 -9.8829 -1.3728
quadrupole: -4.7203 11.5355 -6.8152 -7.4205 -9.8829 -1.3728
hfenergy: -1279.7384655 hartree
pointgroup: C01 [X(C14H24N2O3S1)]
dipole: 2.1076932 0.2391074 -1.2284747 debye
polarizability: 631.8032924|35.2493831|216.7751582|-62.3994246|23.1347018|164.1029493 unknown
InChI: InChI=1S/C14H24N2O3S/c1-11(2)16(8-4-5-9-20(17,18)19)13-6-7-14(15)12(3)10-13/h6-7,10-11,17H,4-5,8-9,15H2,1-3H3
charge 0 multiplicity 1
44 atoms
S  -5.567826 0.11687 1.162568
O  -6.641208 0.948533 -0.151589
O  -5.403897 1.084919 2.453895
O  -6.037266 -1.419079 1.39088
N  0.897841 -1.150585 -0.18002
N  4.55658 3.20255 0.427867
C  -0.341671 -1.157003 0.603645
C  1.043167 -2.257134 -1.170957
C  -1.547006 -0.471194 -0.109705
C  -2.813555 -0.489917 0.783446
C  1.808561 -0.06813 -0.049763
C  -3.977101 0.176269 0.056387
C  2.062241 -3.345843 -0.733718
C  1.268189 -1.770546 -2.625074
C  3.14495 -0.12469 -0.549283
C  1.434584 1.136562 0.619995
C  4.063564 0.937534 -0.410721
C  3.664766 2.129773 0.26948
C  2.343266 2.199196 0.780728
C  5.472971 0.81603 -0.962823
H  -0.620318 -2.20686 0.82538
H  -0.166429 -0.670255 1.581556
H  0.052828 -2.755463 -1.172236
H  -1.273898 0.569217 -0.369251
H  -1.750007 -0.999027 -1.062654
H  -3.076574 -1.535689 1.036326
H  -2.607662 0.040197 1.733619
H  -4.303734 -0.346257 -0.85625
H  -3.850215 1.255256 -0.122716
H  1.987988 -4.223989 -1.402315
H  3.104634 -2.987332 -0.761882
H  1.848916 -3.676699 0.298559
H  0.471846 -1.065166 -2.922704
H  1.244023 -2.635545 -3.313268
H  2.234492 -1.257886 -2.756569
H  3.504542 -1.030811 -1.041767
H  0.423572 1.266455 1.017112
H  2.013862 3.105627 1.304567
H  5.68837 1.60132 -1.716328
H  6.23755 0.907232 -0.164161
H  5.62726 -0.159487 -1.453715
H  5.505202 3.154541 0.072606
H  4.269672 4.040635 0.923442
H  -7.56217 1.046771 0.225209
