program: Gaussian 09
title: 000102989
version: EM64L-G09RevD.01
frameworkgroup: C1[X(C13H19N)]
method: RPBEPBE
basis: SDD
operation: Freq
keyword: #pfreq=noraman
keyword: PBEPBE/SDD
title: #p freq=noraman PBEPBE/SDD
converged: YES YES NO NO
title: Mulliken charges:
elementType: N C C C C C C C C C C C C C H H H H H H H H H H H H H H H H H H H
charge: -0.116651 -0.176840 -0.445107 -0.411594 -0.376406 -0.373622 0.483926 -0.639380 -0.468762 -0.387238 -0.386460 -0.395934 0.430592 -0.810141 0.182065 0.215622 0.217568 0.190220 0.216692 0.203732 0.191062 0.210255 0.166838 0.185504 0.217344 0.252023 0.231866 0.261871 0.224952 0.225573 0.233416 0.223106 0.223908
chargesum: 0.00000
title: Mulliken charges with hydrogens summed into heavy atoms:
elementType: N C C C C C C C C C C C C C
charge: -0.116651 0.005225 -0.011916 -0.004682 0.018388 0.003472 0.483926 0.015491 -0.236896 -0.125367 -0.161509 -0.170361 0.430592 -0.129711
polarizability: 1.94369001e+02 4.99429901e-01 1.10321538e+02 -4.12870462e-01 -7.11148420e+00 1.27184317e+02
1716.lowfreq: -7.5598 0.0004 0.0005 0.0007 3.5518 8.7827 26.2454 42.3434 69.2981
frequency: 25.7807 42.0059 69.2847 80.7862 146.3797 179.1612 210.4203 225.5244 254.3710 301.5642 325.1392 350.8749 365.5620 406.7314 413.2226 425.8776 465.1766 527.7538 541.7121 566.6020 636.0744 729.0930 747.7394 767.3772 811.5221 824.8968 836.3924 856.6184 872.7988 889.7863 934.2607 957.4295 979.9138 984.1878 985.7449 1013.6921 1028.3835 1046.2758 1049.0338 1089.9590 1101.0027 1113.9221 1123.7819 1132.0799 1148.1925 1184.6517 1193.3543 1209.5539 1220.1009 1242.0081 1263.6388 1267.2056 1288.4367 1306.2224 1329.3212 1337.1267 1342.5654 1347.1340 1368.1707 1381.6590 1395.7268 1406.9596 1431.3156 1450.5349 1461.3733 1463.2662 1468.3646 1472.6708 1472.9596 1476.8060 1481.3554 1506.1251 1584.5431 1624.5934 2797.8704 2819.4485 2860.0561 2965.9769 2972.5322 2985.9632 2989.0844 3018.5048 3029.4347 3033.0484 3048.0687 3053.2092 3055.8719 3082.2710 3095.2288 3106.2632 3112.9213 3130.9306 3142.9955
redmass: 1.0169 3.5165 3.4610 2.9793 2.7838 3.3870 1.8608 1.9433 1.8882 2.0794 2.1279 3.2671 2.4369 2.8611 2.6239 3.4331 3.2339 2.2101 2.4437 3.2409 6.8703 3.1138 2.9753 3.5568 2.3530 1.5398 1.8152 1.2600 2.6010 1.8171 1.8585 1.3893 1.4625 1.7170 1.5205 2.7656 1.8075 1.5587 2.2071 1.5780 1.7664 1.5214 1.6642 1.6748 1.6317 1.1524 1.9663 2.2629 2.7766 1.4722 1.5163 1.5379 1.3438 1.2655 1.3925 1.3878 1.5597 1.5636 1.4334 3.4196 1.2265 2.6478 1.1762 1.0902 1.0876 1.0750 1.0778 1.0820 1.0633 1.0799 1.0590 2.7599 6.0790 6.4760 1.0796 1.0709 1.0571 1.0625 1.0386 1.0622 1.0610 1.0873 1.0747 1.0950 1.1029 1.0949 1.1032 1.0997 1.0990 1.0868 1.0880 1.0961 1.0957
irintensity: 0.5187 0.2478 0.6874 0.5968 0.7998 0.7396 0.4588 0.7789 0.3933 3.3903 0.4631 1.2760 3.0249 0.4617 1.4673 1.8664 0.4719 3.4952 16.4613 2.9963 0.6788 2.1941 7.7285 1.9524 9.3020 44.9193 1.7237 1.0203 3.5193 1.1103 2.9354 3.2823 0.4461 6.0769 1.9295 6.6737 40.2677 17.4396 8.7773 1.0043 10.9559 16.2192 17.3079 7.2938 6.6727 3.2029 6.0759 0.7385 0.5191 0.5518 6.7618 17.7901 4.7495 8.8754 9.2776 0.4000 2.0281 3.3256 7.8026 1.9584 9.1771 2.3903 7.4832 6.3252 13.1633 22.2094 0.7855 15.9859 15.8586 4.8624 6.7347 33.9799 0.2550 0.7005 41.7730 115.4432 149.3677 44.2562 42.8287 28.2924 29.1468 54.7324 54.0552 52.4520 27.9697 25.0838 68.0358 19.0365 29.9104 13.5316 20.8622 33.1292 5.2848
temp: 298.150 k
press: 1.00000 atm
elementType: 7 6 6 6 6 6 6 6 6 6 6 6 6 6 1 1 1 1 1 1 1 1 1 1 1 1 1 1 1 1 1 1 1
symmnumber: 1
zpe: 758800.3 jmol-1
zpe.correction: 0.289012 hartree
zpe.thermalcorrener: 0.302727 hartree
zpe.thermalcorrenthalpy: 0.303671 hartree
zpe.thermalcorrgfe: 0.247801 hartree
zpe.sumelectzpe: -560.458898 hartree
zpe.sumelectthermal: -560.445183 hartree
zpe.sumelectthermalent: -560.444239 hartree
zpe.sumelectthermalfe: -560.500109 hartree
dipole: -0.1694 0.0091 0.5764
dipole: 0.6009
quadrupole: -77.2923 -86.9105 -82.9393
quadrupole: 0.1849 -0.9693 -1.0877
quadrupole: 5.0884 -4.5298 -0.5586 0.1849 -0.9693 -1.0877
hfenergy: -560.7479097 hartree
pointgroup: C01 [X(C13H19N1)]
dipole: 0.0658524 -0.0680933 0.2165857 debye
polarizability: 194.3612145|0.5378683|107.8056987|0.8164625|1.3368436|129.7079425 unknown
InChI: InChI=1S/C13H19N/c1-11-6-8-12(9-7-11)13-5-3-4-10-14(13)2/h6-9,13H,3-5,10H2,1-2H3
charge 0 multiplicity 1
33 atoms
N  1.778275 -0.925178 -0.380592
C  1.071246 0.033753 0.523042
C  1.612322 1.476125 0.301817
C  3.142837 1.555784 0.470425
C  3.818992 0.537172 -0.470993
C  3.255099 -0.871176 -0.212249
C  -0.439305 0.01618 0.295659
C  1.298038 -2.316281 -0.212792
C  -1.340188 -0.002675 1.386324
C  -0.973914 0.088254 -1.016075
C  -2.736969 0.050076 1.175434
C  -2.367801 0.134286 -1.225288
C  -3.27667 0.115097 -0.133903
C  -4.778635 0.131748 -0.364401
H  1.266709 -0.239403 1.596737
H  1.096554 2.154768 1.006937
H  1.334317 1.794229 -0.72174
H  3.417061 1.324796 1.521012
H  3.49838 2.582865 0.262498
H  3.625259 0.816938 -1.524542
H  4.91583 0.526326 -0.321529
H  3.701657 -1.597051 -0.917975
H  3.550519 -1.19423 0.823024
H  1.483078 -2.71785 0.816149
H  1.818689 -2.971372 -0.934312
H  0.215895 -2.37388 -0.411744
H  -0.946703 -0.058807 2.409515
H  -0.280976 0.086906 -1.865493
H  -3.416443 0.035902 2.036989
H  -2.761007 0.186708 -2.248608
H  -5.177055 -0.896145 -0.473407
H  -5.313422 0.602389 0.479593
H  -5.040971 0.682748 -1.285011
