program: Gaussian 09
title: 000008961
version: EM64L-G09RevD.01
frameworkgroup: C1[X(C9H9ClO)]
method: RPBEPBE
basis: SDD
operation: Freq
keyword: #p
keyword: freq=noraman
keyword: PBEPBE/SDD
title: #p freq=noraman PBEPBE/SDD
converged: NO NO NO NO
title: Mulliken charges:
elementType: Cl O C C C C C C C C C H H H H H H H H H
charge: -0.068282 -0.427352 -0.443839 -0.520198 -0.536575 0.186442 0.467918 0.111564 -0.386947 -0.395661 -0.217690 0.219678 0.225888 0.231482 0.243983 0.243922 0.237265 0.221632 0.250164 0.356608
chargesum: 0.00000
title: Mulliken charges with hydrogens summed into heavy atoms:
elementType: Cl O C C C C C C C C C
charge: -0.068282 -0.070744 0.001726 -0.044733 -0.055388 0.186442 0.467918 0.111564 -0.386947 -0.174029 0.032473
polarizability: 1.36471603e+02 -3.83688688e+00 1.22820431e+02 4.52753342e-01 2.10399861e+00 5.50911964e+01
1716.lowfreq: -0.0006 0.0026 0.0027 2.3998 3.8477 14.3616 111.7408 138.7230 150.6052
frequency: 111.7375 138.7224 150.6022 184.6496 240.2957 262.7102 331.2647 356.8647 360.0844 488.1031 509.4645 517.4096 546.9095 570.0381 638.1711 684.0027 705.6590 785.3562 832.8608 858.5881 887.0265 912.0855 914.1851 967.6546 1018.9738 1043.1197 1109.5881 1130.8524 1144.8395 1180.4505 1192.7844 1208.9621 1219.2681 1258.9394 1284.3521 1288.4787 1318.6153 1392.9154 1431.7528 1456.7412 1461.3312 1471.4911 1480.2243 1589.1180 1626.0637 2976.8118 2978.3013 3006.9809 3055.1232 3057.8454 3080.9417 3121.9885 3167.8246 3575.0784
redmass: 6.7937 2.1915 2.5867 7.0750 2.2675 5.1315 4.9507 14.3678 1.1703 3.2141 4.2037 5.1057 3.2670 4.2961 3.4145 3.3960 3.4981 1.4645 2.3552 2.8406 1.9855 1.3365 2.3739 3.5124 2.3192 1.6742 2.4486 1.3031 1.4050 1.4564 1.4650 1.3684 1.6329 2.6882 1.5523 1.4902 1.4901 5.9421 4.0804 1.6330 1.1877 1.5156 1.1010 7.6242 8.1690 1.0680 1.0666 1.0639 1.0945 1.0929 1.1037 1.0895 1.0949 1.0660
irintensity: 0.1247 2.1059 0.3664 1.2442 18.7112 10.9356 2.4185 1.2534 124.0524 0.5514 0.6088 9.8977 1.6113 9.9869 19.5766 8.7090 1.0382 53.8565 8.0840 16.4765 13.0971 0.3065 7.0469 41.6713 2.9920 1.0888 104.1990 1.2214 70.3475 0.5439 2.3273 8.4149 29.9631 84.7886 5.0956 0.8447 9.2149 0.7288 51.3150 30.0089 43.6189 17.6556 8.2158 9.5924 7.2520 24.9641 23.1156 37.5981 15.4416 23.9375 48.0790 14.5037 4.5016 34.3765
temp: 298.150 k
press: 1.00000 atm
elementType: 17 8 6 6 6 6 6 6 6 6 6 1 1 1 1 1 1 1 1 1
symmnumber: 1
zpe: 408430.2 jmol-1
zpe.correction: 0.155563 hartree
zpe.thermalcorrener: 0.165161 hartree
zpe.thermalcorrenthalpy: 0.166105 hartree
zpe.thermalcorrgfe: 0.120610 hartree
zpe.sumelectzpe: -882.845984 hartree
zpe.sumelectthermal: -882.836386 hartree
zpe.sumelectthermalent: -882.835442 hartree
zpe.sumelectthermalfe: -882.880937 hartree
dipole: 1.9026 -1.0384 -0.0069
dipole: 2.1675
quadrupole: -75.2990 -57.2071 -73.3982
quadrupole: -4.2704 -0.1219 0.7244
quadrupole: -6.6643 11.4277 -4.7634 -4.2704 -0.1219 0.7244
hfenergy: -883.0015472 hartree
pointgroup: C01 [X(C9H9Cl1O1)]
dipole: 0.7801182 -0.34445 -0.0015715 debye
dipolederiv: -0.8189906 0.0251177 0.0002811 0.0640628 -0.1475873 -0.0030073 -0.0018039 0.0001305 -0.0745456 -1.3999493 0.3231061 0.0004891 0.2072871 -0.1206693 0.0152926 -0.0075278 0.0179789 -0.4094945 0.0042449 0.0195674 0.0066884 0.0138903 0.120061 0.0527279 -0.0073823 -0.0308529 0.1514581 0.0072389 -0.0568715 -0.0216615 -0.0063516 0.0130098 0.0096276 -0.019736 -0.0258816 0.1683019 0.0395414 0.0576238 0.0293897 0.0268097 -0.0223163 0.0002919 0.0167479 -0.0351874 0.1520837 -0.1528836 0.2346548 -0.0001643 0.3085971 0.0143416 0.0121912 0.0355776 0.0577715 -0.076526 -0.1891361 -0.1665491 0.0000469 -0.0422759 0.1837918 0.0115794 -0.0178793 0.0659746 -0.0024993 1.3047745 -0.3541421 0.0061192 -0.2930308 0.0992688 0.0022246 0.0053663 -0.0065395 0.0633392 1.1081974 -0.0144208 -0.0036516 -0.1040142 -0.0508226 0.0060385 0.0032137 -0.0044898 -0.1123851 -0.2501035 0.1045761 0.0015134 -0.1294539 -0.0155914 0.0091521 -0.0102896 0.0087141 -0.2111643 -0.1732417 -0.0862993 -0.0014167 0.0032968 0.016425 0.0060228 0.00452 0.0037121 -0.0932571 0.0614378 -0.0344143 -0.0093619 -0.0384065 -0.1834077 -0.0721539 -0.0149018 -0.1132031 0.0467178 0.0440929 0.0040411 0.0022137 0.0045738 0.0774021 0.0179186 0.014748 0.09683 -0.162381 0.0461821 -0.0153008 -0.0621858 -0.0426192 -0.0102052 -0.0244508 -0.1086481 -0.0448468 -0.1086143 -0.0674532 -0.024994 0.0849477 -0.0076493 0.0420392 0.0019818 0.1138447 0.0415765 0.0271188 -0.051239 0.0490385 -0.0826402 0.0188406 0.0287118 0.0206053 -0.0939331 0.0659452 0.0291881 0.0549941 -0.0048673 0.053424 0.0136532 -0.0143771 -0.0355624 0.0877667 -0.0635207 -0.1030933 0.0020576 0.099022 0.003933 0.083234 -0.0816799 -0.0093933 0.0025953 -0.0111965 0.1734064 0.0389847 -0.0782064 -0.0047657 -0.0729747 -0.0023096 -0.0068867 -0.004705 -0.0086871 0.1639645 0.3912504 -0.080682 -0.0031984 -0.0074694 0.0539152 -0.0141999 0.0024268 -0.0142279 0.3783819 unknown
polarizability: 137.0163222|-2.6421829|122.2940938|0.2424662|1.8290755|55.0728149 unknown
InChI: InChI=1S/C9H9ClO/c10-8-4-5-9(11)7-3-1-2-6(7)8/h4-5,11H,1-3H2
charge 0 multiplicity 1
20 atoms
Cl -3.289747 -0.388653 0.009825
O  2.721157 -1.113837 0.021114
C  0.395216 2.66122 -0.273479
C  1.506259 1.634667 0.114178
C  -0.955366 1.978991 0.113077
C  0.777948 0.302862 0.045224
C  -0.625554 0.495759 0.042563
C  1.316794 -0.999498 0.007375
C  -1.475351 -0.623193 0.004291
C  0.44867 -2.119951 -0.044063
C  -0.952053 -1.931375 -0.045297
H  0.530974 3.638584 0.220751
H  0.418927 2.828173 -1.366493
H  1.877544 1.811775 1.144401
H  2.387986 1.671703 -0.548741
H  -1.79286 2.262314 -0.548159
H  -1.260526 2.247082 1.145265
H  0.854396 -3.138947 -0.084751
H  -1.625209 -2.792674 -0.08628
H  2.999295 -2.063002 -0.0169
