program: Gaussian 09
title: 000103027
version: EM64L-G09RevD.01
frameworkgroup: C1[X(C12H26O6P2S4)]
method: RPBEPBE
basis: SDD
operation: Freq
keyword: #p
keyword: freq=noraman
keyword: PBEPBE/SDD
title: #p freq=noraman PBEPBE/SDD
converged: YES YES NO NO
title: Mulliken charges:
elementType: S S S S P P O O O O O O C C C C C C C C C C C C H H H H H H H H H H H H H H H H H H H H H H H H H H
charge: 0.047421 0.047326 -0.218107 -0.218185 0.607179 0.607343 -0.224417 -0.224416 -0.466300 -0.467956 -0.467941 -0.466297 -0.305065 -0.305039 -0.288224 -0.288237 -0.212053 -0.218067 -0.218074 -0.212073 -0.657837 -0.653197 -0.653151 -0.657801 0.308655 0.308542 0.222491 0.216922 0.222495 0.216908 0.250540 0.228352 0.236083 0.229827 0.236039 0.229834 0.250504 0.228357 0.236987 0.230494 0.211106 0.237892 0.234259 0.213099 0.213088 0.234270 0.237857 0.211103 0.230473 0.236993
chargesum: 0.00000
title: Mulliken charges with hydrogens summed into heavy atoms:
elementType: S S S S P P O O O O O O C C C C C C C C C C C C
charge: 0.047421 0.047326 -0.218107 -0.218185 0.607179 0.607343 -0.224417 -0.224416 -0.466300 -0.467956 -0.467941 -0.466297 0.003590 0.003503 0.151189 0.151166 0.266838 0.247843 0.247799 0.266788 0.020751 0.032052 0.032063 0.020768
polarizability: 3.41701778e+02 4.60347011e-03 3.11599893e+02 2.02117351e+01 -1.57356733e-02 2.28342163e+02
1716.lowfreq: -9.3039 -5.7334 -1.7362 -0.0013 0.0017 0.0021 12.8857 15.8372 16.7547
frequency: 11.9487 15.8089 16.6866 28.6137 30.7531 36.5845 39.3002 41.3558 59.9875 63.1922 70.5647 70.7735 80.3680 82.9905 87.7114 94.0513 103.9238 108.0415 115.7785 130.3913 131.8665 168.5541 168.6156 190.4412 202.2109 236.0576 238.3823 243.7162 245.1736 257.8020 257.8936 264.9217 278.3531 289.0952 293.7416 301.8535 317.4452 323.4883 330.1966 335.9871 378.5598 386.5980 397.5118 425.4274 429.8494 433.0913 433.6260 537.2038 543.3324 549.2416 674.0432 674.3924 712.7613 715.1693 764.0676 765.5644 814.0593 814.5227 815.1265 815.2543 823.4594 828.4486 862.4601 862.8819 888.2075 888.2890 917.4441 918.1692 1011.5685 1013.7513 1014.1570 1025.1814 1025.7516 1036.1525 1044.4905 1092.2659 1102.9068 1103.1145 1108.1585 1108.5653 1136.3148 1136.3960 1139.6673 1140.0300 1195.9822 1217.5091 1218.6798 1259.3712 1260.7704 1261.0778 1262.3120 1262.6549 1267.4386 1320.4581 1340.3916 1353.9428 1357.1578 1357.2061 1361.0456 1361.4759 1392.9805 1393.1346 1396.7025 1396.7838 1444.8688 1446.7830 1456.6375 1456.6768 1457.5143 1457.5370 1473.5834 1473.7883 1474.3246 1474.6484 1483.6906 1483.7021 1486.5660 1486.6899 2976.9069 2983.4380 2985.1838 2985.4220 2990.6538 2990.6755 2995.6160 2995.6518 2995.9651 2997.1919 2997.2164 3006.3107 3053.6130 3053.8479 3059.9593 3059.9745 3086.8600 3090.1904 3091.8449 3091.8483 3093.5042 3093.5870 3109.4998 3109.5607 3111.9453 3111.9676
redmass: 7.4240 5.4849 5.2238 4.9098 3.4399 4.2450 3.4122 3.9022 6.5339 4.5257 3.0488 2.6702 2.4912 2.2889 2.0597 1.9460 6.6005 4.7166 6.4380 8.7428 10.0648 4.5229 6.3421 3.4987 4.3198 1.5573 1.4061 2.3643 2.2090 1.6942 1.7074 3.0975 4.7980 5.0193 4.6260 6.6053 5.2855 6.9934 2.2156 6.1419 8.8213 7.6724 8.6785 5.9389 7.8955 5.7179 6.8877 2.6161 10.0215 12.8611 6.1005 6.0988 7.9613 7.9392 5.0935 3.1710 1.1140 1.0968 1.0906 1.0915 4.3372 5.1360 4.8372 4.7733 3.6221 3.6023 3.7243 4.0419 2.9151 2.3290 2.3416 2.8799 2.8727 4.2430 6.1349 2.0361 2.2564 2.2552 2.2146 2.2160 1.4349 1.4354 1.4344 1.4329 1.0935 1.1774 1.1285 1.2005 1.1343 1.1363 1.1312 1.1320 1.2090 1.1656 1.2458 1.2503 1.2522 1.2523 1.2442 1.2425 1.2490 1.2488 1.2398 1.2406 1.0891 1.0916 1.0399 1.0399 1.0394 1.0395 1.0591 1.0553 1.0612 1.0572 1.0686 1.0685 1.0737 1.0732 1.0677 1.0611 1.0559 1.0557 1.0539 1.0538 1.0385 1.0402 1.0836 1.0369 1.0369 1.0855 1.1082 1.1081 1.1084 1.1084 1.0976 1.1034 1.0983 1.0983 1.0981 1.0981 1.1023 1.1023 1.1024 1.1024
irintensity: 0.1007 0.0288 0.0934 0.3716 0.0156 0.2947 0.0266 1.1347 0.4320 0.4098 2.3225 0.0771 0.7134 1.0674 0.7925 15.0285 0.3832 5.1274 7.5006 1.0345 1.0293 4.7929 1.4934 0.2629 0.5976 10.0078 0.0745 1.2846 1.0117 1.4809 0.3764 23.4397 0.2491 23.4941 0.1204 1.0674 9.0088 16.4148 1.3330 0.8881 0.5941 83.2174 15.8823 128.5044 0.2462 2.5219 1.8345 0.4812 261.6311 69.3870 34.1598 54.4890 74.8616 91.2998 47.4510 39.1810 1.9534 1.7211 3.4038 19.3944 0.8176 11.5668 291.3189 236.3585 40.3302 6.1675 115.8786 29.8529 3.5035 174.5186 158.1584 1.1024 11.3232 140.4093 31.8836 1.8146 10.1110 11.4210 1.6258 1.3687 0.9045 1.1842 12.7280 2.8593 4.0896 8.5839 18.5898 2.6068 0.1016 0.0139 0.0879 0.4293 10.9561 3.0216 0.2913 4.5167 11.5115 9.3696 3.9584 2.8273 17.3607 41.0466 58.4957 0.9155 13.3677 1.6297 15.9172 3.7556 6.9415 18.6079 7.2892 5.2419 2.7952 2.6671 3.7696 14.5356 17.9647 9.8457 40.4093 46.1915 34.2697 6.5606 25.6879 18.2655 20.0942 30.2981 2.3958 19.3881 12.6849 1.9544 3.8851 20.5029 6.8299 2.8176 36.5531 15.4927 1.6963 56.3146 2.8360 35.4265 48.3798 11.2775 7.8807 65.7466
temp: 298.150 k
press: 1.00000 atm
elementType: 16 16 16 16 15 15 8 8 8 8 8 8 6 6 6 6 6 6 6 6 6 6 6 6 1 1 1 1 1 1 1 1 1 1 1 1 1 1 1 1 1 1 1 1 1 1 1 1 1 1
symmnumber: 1
zpe: 1008358.5 jmol-1
zpe.correction: 0.384063 hartree
zpe.thermalcorrener: 0.417597 hartree
zpe.thermalcorrenthalpy: 0.418541 hartree
zpe.thermalcorrgfe: 0.312106 hartree
zpe.sumelectzpe: -3196.922444 hartree
zpe.sumelectthermal: -3196.888910 hartree
zpe.sumelectthermalent: -3196.887966 hartree
zpe.sumelectthermalfe: -3196.994401 hartree
dipole: -0.0005 4.7450 -0.0028
dipole: 4.7450
quadrupole: -203.0834 -169.9790 -190.8390
quadrupole: -0.0168 0.2312 0.0035
quadrupole: -15.1163 17.9881 -2.8719 -0.0168 0.2312 0.0035
hfenergy: -3197.3065072 hartree
pointgroup: C01 [X(C12H26O6P2S4)]
dipole: -0.001668 -0.0040045 1.8668136 debye
polarizability: 326.3714312|-43.7187033|243.6731359|-0.0976117|-0.2124558|311.5992667 unknown
InChI: InChI=1S/2C4H10O2PS.C4H6O2S2/c2*1-3-5-7(8)6-4-2;7-3-4(8)6-2-1-5-3/h2*3-4H2,1-2H3;3-4H,1-2H2
charge 0 multiplicity 1
50 atoms
S  -1.026725 1.434881 -0.505719
S  1.025573 -1.432379 -0.510344
S  -4.075527 1.814384 -2.478502
S  4.078607 -1.804565 -2.477965
P  -3.187392 0.728018 -0.971085
P  3.187532 -0.724332 -0.967868
O  -0.957218 1.060885 2.164996
O  0.949331 -1.071809 2.161975
O  -3.933965 0.611111 0.58243
O  -3.016391 -0.986766 -1.131128
O  3.018223 0.991272 -1.121036
O  3.931011 -0.614467 0.587655
C  -0.726799 0.265412 0.942921
C  0.722232 -0.270034 0.94339
C  -0.728973 0.240597 3.380259
C  0.717653 -0.25803 3.380948
C  -4.213555 1.886488 1.315339
C  -2.486997 -1.509412 -2.430033
C  2.492489 1.520255 -2.41885
C  4.209006 -1.893224 1.315314
C  -4.97825 1.479347 2.570012
C  -2.482415 -3.027874 -2.293508
C  2.491413 3.038186 -2.276278
C  4.971476 -1.492047 2.573257
H  -1.453247 -0.569918 0.880641
H  1.448866 0.565552 0.88715
H  -0.937977 0.915701 4.226588
H  -1.434487 -0.615486 3.392985
H  0.924253 -0.937682 4.224226
H  1.423144 0.597948 3.400265
H  -3.246013 2.363021 1.558586
H  -4.811139 2.550686 0.662034
H  -3.148524 -1.163117 -3.246261
H  -1.465536 -1.109895 -2.58255
H  3.154703 1.175532 -3.235194
H  1.470327 1.123933 -2.57488
H  3.241016 -2.37078 1.55471
H  4.807708 -2.554523 0.660082
H  -5.917147 0.963036 2.308768
H  -4.367421 0.806007 3.19518
H  -5.224479 2.379851 3.162542
H  -1.822475 -3.344265 -1.468319
H  -3.500091 -3.407062 -2.101258
H  -2.108869 -3.481306 -3.230192
H  2.120519 3.496309 -3.211727
H  3.509672 3.414128 -2.08078
H  1.830862 3.352864 -1.450916
H  5.2166 -2.395398 3.161898
H  4.359539 -0.821703 3.200557
H  5.910857 -0.974531 2.316181
