program: Gaussian 09
title: 000103029
version: EM64L-G09RevD.01
frameworkgroup: C1[X(C18H32O)]
method: RPBEPBE
basis: SDD
operation: Freq
keyword: #pfreq=noraman
keyword: PBEPBE/SDD
title: #p freq=noraman PBEPBE/SDD
converged: YES YES NO NO
title: Mulliken charges:
elementType: O C C C C C C C C C C C C C C C C C C H H H H H H H H H H H H H H H H H H H H H H H H H H H H H H H H
charge: -0.215616 -0.033722 -0.411581 -0.418031 -0.384499 -0.365653 -0.031188 -0.392133 -0.749097 -0.510431 -0.713586 -0.702422 0.244537 -0.808370 -0.015804 -0.270229 -0.528750 0.242680 -0.781243 0.190142 0.206452 0.186331 0.212872 0.199492 0.206691 0.177858 0.185724 0.186255 0.194566 0.213734 0.196578 0.211801 0.211671 0.212877 0.197403 0.221117 0.205614 0.211004 0.214561 0.193892 0.207721 0.217282 0.238707 0.235139 0.226034 0.261214 0.240327 0.239210 0.242558 0.244803 0.255507
chargesum: 0.00000
title: Mulliken charges with hydrogens summed into heavy atoms:
elementType: O C C C C C C C C C C C C C C C C C C
charge: -0.215616 0.156420 -0.018798 -0.005666 0.000050 0.006326 0.163378 0.018179 -0.112747 -0.091911 -0.082407 -0.083527 0.244537 -0.108490 -0.015804 -0.009015 -0.049213 0.242680 -0.038375
polarizability: 2.31888724e+02 2.44097882e+01 2.20830778e+02 -4.92385046e+00 -8.94684490e-01 1.56025589e+02
1716.lowfreq: -27.5045 -10.1135 -0.0008 -0.0004 0.0003 4.2717 9.4870 21.4889 26.2425
frequency: -16.4377 21.4213 25.1113 27.9236 41.9317 47.3679 68.4067 71.3943 93.8582 97.6251 105.3090 117.9852 125.5328 139.6775 166.3480 171.4469 181.9777 201.5466 210.4602 223.4212 237.5937 244.3418 267.9501 279.8048 283.5844 328.2608 356.7401 374.4207 392.4539 410.4369 422.7984 435.2623 448.3180 483.8947 547.4010 552.1737 563.8207 597.7483 710.0339 730.6337 757.1647 777.1387 788.2893 807.2384 834.5585 843.5016 857.8174 870.6328 914.3499 916.7753 932.0435 938.4993 952.6769 957.5199 970.5544 981.7321 989.0888 1008.5712 1018.7143 1026.8880 1036.3474 1054.1895 1063.2172 1076.5851 1093.7329 1113.7887 1133.5169 1159.1371 1161.0456 1166.6635 1171.4967 1176.4007 1182.8055 1206.1914 1214.7358 1233.0045 1240.3377 1267.1106 1272.6037 1279.9932 1290.8177 1295.7744 1300.4469 1310.9957 1326.3765 1330.5841 1334.2629 1343.0448 1354.2954 1359.6167 1369.2328 1372.7806 1380.0296 1384.0081 1391.3934 1409.4122 1417.8384 1444.0079 1453.9900 1455.6978 1456.0132 1460.6721 1463.6328 1467.4976 1468.1542 1470.2022 1472.6470 1474.0353 1476.6869 1479.7760 1480.8934 1485.5283 1487.7152 1637.9388 2005.5429 2935.5273 2937.9695 2944.2755 2951.6886 2955.1691 2958.8208 2960.7930 2961.6741 2964.7376 2966.7478 2968.8792 2970.6259 2977.6281 2979.2493 2992.4020 3000.7757 3004.5404 3026.6378 3030.1538 3037.0650 3040.9675 3044.4518 3051.6365 3062.3521 3063.7300 3065.0379 3065.8893 3066.1794 3069.5704 3080.4893 3094.3750 3118.7952
redmass: 3.7873 4.0174 3.0061 2.9834 3.8830 3.2030 3.5931 3.0318 2.6423 2.8717 1.5074 1.8838 2.0363 1.9304 1.7818 2.2894 1.3677 1.2095 1.9793 1.1476 2.1921 1.2818 2.4300 2.9591 2.7845 2.5376 2.4473 2.5965 2.2782 2.7529 2.3137 2.3014 2.2145 3.2253 3.5835 2.3274 4.2865 3.6409 2.6783 1.1453 1.3360 2.0612 1.9344 1.7277 1.9399 2.0039 1.6670 1.7762 1.8087 1.1891 1.7684 1.7816 1.3778 2.1490 1.5032 1.9429 1.7244 2.0882 1.6617 1.4886 1.5538 2.0466 2.2972 2.5825 2.1066 1.6367 2.0393 1.7904 1.5879 2.1121 1.4624 1.8187 2.4172 1.5553 1.5012 1.3740 1.3306 1.2330 1.2318 1.2445 1.1158 1.7084 1.3767 1.3292 1.4783 1.4304 1.4122 1.5064 1.5687 1.4076 1.2354 1.2238 1.2105 1.2210 1.2142 1.6166 1.4506 1.0676 1.0717 1.0695 1.0615 1.0731 1.0623 1.1055 1.0456 1.0688 1.0829 1.0505 1.1215 1.0730 1.0732 1.0577 1.0556 7.9650 10.8962 1.0681 1.0775 1.0615 1.0607 1.0761 1.0600 1.0399 1.0607 1.0372 1.0363 1.0575 1.0412 1.0620 1.0381 1.0975 1.0989 1.0987 1.1018 1.0892 1.1037 1.0976 1.1024 1.0988 1.0990 1.0993 1.0988 1.0994 1.0947 1.0985 1.0874 1.0988 1.1007
irintensity: 0.0158 2.1990 0.9582 0.0660 3.6880 0.2076 2.0036 0.0986 0.2077 1.1327 0.7478 0.1316 1.1997 1.1491 3.1733 0.2485 1.5747 0.2070 0.9840 0.0908 1.2445 0.2035 2.2656 1.3369 0.0609 0.4007 0.5680 1.6448 0.1714 1.4642 0.7647 0.9641 0.9351 12.7717 4.1703 5.1300 12.1530 3.3794 3.3882 7.5702 12.3721 0.9799 5.6241 0.2231 5.2855 3.1372 10.4752 4.8186 1.7566 4.7027 3.6165 14.4533 0.7495 2.1563 2.8888 0.0230 4.8070 0.0479 4.6025 4.2553 1.3947 8.4712 1.2050 1.8311 0.5990 3.1977 0.8482 4.2484 36.8528 6.8719 40.0995 6.4756 11.1171 2.8106 3.6540 5.9380 10.5247 4.5402 1.7784 1.6844 2.3282 42.8661 22.3002 11.1147 0.0237 2.6988 4.4093 3.3832 7.8276 2.1729 45.1054 38.7552 16.5000 17.8276 13.7951 24.2349 21.4918 22.7805 1.0404 9.8386 9.6445 2.5824 3.4577 11.1550 2.8397 0.0998 8.6167 10.8982 5.8623 5.4264 4.9006 15.4577 26.6450 135.7679 10.3388 27.1689 18.7467 12.4792 7.8339 16.4961 25.9380 51.2811 25.3910 37.9252 32.9407 92.1587 54.4981 49.5365 2.4196 12.6839 0.2998 6.4080 81.0346 13.8740 83.7937 28.6305 62.9320 14.8371 88.4522 55.3392 63.1130 56.3860 6.1125 54.7533 13.9440 25.3528 16.5023
temp: 298.150 k
press: 1.00000 atm
elementType: 8 6 6 6 6 6 6 6 6 6 6 6 6 6 6 6 6 6 6 1 1 1 1 1 1 1 1 1 1 1 1 1 1 1 1 1 1 1 1 1 1 1 1 1 1 1 1 1 1 1 1
symmnumber: 1
zpe: 1188570.4 jmol-1
zpe.correction: 0.452703 hartree
zpe.thermalcorrener: 0.476967 hartree
zpe.thermalcorrenthalpy: 0.477912 hartree
zpe.thermalcorrgfe: 0.396603 hartree
zpe.sumelectzpe: -778.746854 hartree
zpe.sumelectthermal: -778.722589 hartree
zpe.sumelectthermalent: -778.721645 hartree
zpe.sumelectthermalfe: -778.802953 hartree
dipole: -3.2639 1.5732 0.9457
dipole: 3.7446
quadrupole: -141.7612 -116.0477 -119.4933
quadrupole: 10.2341 4.9378 0.5049
quadrupole: -15.9938 9.7197 6.2741 10.2341 4.9378 0.5049
hfenergy: -779.1995562 hartree
pointgroup: C01 [X(C18H32O1)]
dipole: -1.3162584 -0.4891199 -0.4457369 debye
polarizability: 227.1431792|-25.2144666|225.1462833|6.6757517|0.4774522|156.4556289 unknown
InChI: InChI=1S/C18H32O/c1-15(2)9-6-10-16(3)11-7-12-17(4)13-8-14-18(5)19/h8,15-16H,6-7,9-12,14H2,1-5H3
charge 0 multiplicity 1
51 atoms
O  5.221568 -0.34656 0.435318
C  -3.399153 1.258524 -0.122978
C  -3.203621 -0.177536 0.445589
C  -2.243533 -1.097833 -0.345909
C  -2.086692 2.086217 -0.202756
C  -2.156913 -2.512068 0.274922
C  -1.31946 -3.539809 -0.533085
C  -1.338852 2.231183 1.141671
C  -4.109684 1.239377 -1.498805
C  -0.194126 3.283727 1.124968
C  -1.450596 -4.951522 0.087599
C  0.170029 -3.130949 -0.632497
C  0.910536 3.001495 0.093947
C  0.87006 3.798799 -1.207686
C  1.871214 2.104098 0.326417
C  2.848522 1.228962 0.552545
C  2.7864 -0.249969 0.197965
C  4.167996 -0.893755 0.016844
C  4.190562 -2.240651 -0.696387
H  -4.07065 1.786137 0.59051
H  -2.844929 -0.110542 1.493146
H  -4.199354 -0.6664 0.496994
H  -1.235682 -0.638706 -0.378952
H  -2.585632 -1.187061 -1.397103
H  -1.40895 1.637484 -0.956829
H  -2.343856 3.09857 -0.580704
H  -3.187431 -2.910559 0.38723
H  -1.74074 -2.439105 1.303021
H  -1.733716 -3.576487 -1.563915
H  -0.911485 1.254811 1.443852
H  -2.063881 2.51929 1.93206
H  -3.472522 0.777348 -2.276303
H  -4.350237 2.265754 -1.834212
H  -5.055478 0.66708 -1.453495
H  -0.627171 4.28202 0.912232
H  0.249744 3.332573 2.137341
H  -1.053089 -4.962109 1.121206
H  -0.888442 -5.703091 -0.497774
H  -2.507821 -5.274028 0.130274
H  0.610843 -3.040372 0.380752
H  0.750759 -3.890039 -1.190117
H  0.295922 -2.161851 -1.148499
H  -0.097262 3.655679 -1.726482
H  1.682801 3.506303 -1.892947
H  0.967462 4.882085 -0.997304
H  3.793208 1.549123 1.018681
H  2.28865 -0.824174 1.012757
H  2.169047 -0.432681 -0.701875
H  4.148754 -2.068237 -1.790312
H  3.312315 -2.8565 -0.431711
H  5.121768 -2.782548 -0.467905
