program: Gaussian 09
title: 000102984
version: EM64L-G09RevD.01
frameworkgroup: C1[X(C10H16O2)]
method: RPBEPBE
basis: SDD
operation: Freq
keyword: #pfreq=noraman
keyword: PBEPBE/SDD
title: #p freq=noraman PBEPBE/SDD
converged: YES YES NO NO
title: Mulliken charges:
elementType: O O C C C C C C C C C C H H H H H H H H H H H H H H H H
charge: -0.233538 -0.369917 0.365087 -0.523846 -0.582703 0.365575 -0.297659 -0.740839 -0.337118 0.185364 -0.805688 -0.786063 0.217619 0.225120 0.217930 0.220121 0.240668 0.215081 0.229266 0.250633 0.206135 0.231807 0.224207 0.241352 0.228862 0.224484 0.231569 0.356493
chargesum: 0.00000
title: Mulliken charges with hydrogens summed into heavy atoms:
elementType: O O C C C C C C C C C C
charge: -0.233538 -0.013425 0.365087 -0.081107 -0.144652 0.365575 -0.056991 -0.045859 -0.130983 0.185364 -0.108322 -0.101149
polarizability: 1.93452696e+02 -1.45028733e+00 1.04683891e+02 -3.16162769e+00 2.20520574e+00 8.50921843e+01
1716.lowfreq: -12.2654 0.0008 0.0010 0.0011 12.6415 19.3074 38.6039 81.1070 98.5306
frequency: 38.3780 80.8841 98.5218 116.8874 118.4586 160.5271 201.0932 202.6552 211.8825 217.3201 271.9969 281.2584 332.6822 370.3202 394.7760 411.0124 452.3709 468.6695 498.6369 530.4824 594.8000 642.3356 706.3346 749.5496 777.6017 805.8407 831.6997 889.0697 930.2774 951.2160 955.8812 964.1800 973.8590 987.9266 1021.3360 1074.6612 1084.0179 1108.1172 1117.5868 1138.2717 1207.8579 1212.1507 1223.0170 1247.9208 1278.9478 1307.0217 1318.1114 1347.7388 1375.5806 1387.9182 1391.9261 1407.2380 1454.9525 1458.6882 1461.2395 1465.7345 1469.2068 1479.4125 1479.9743 1485.2737 1616.1733 1648.6980 2958.1909 2961.8661 2964.0366 2990.7291 2996.0180 3028.0642 3030.2419 3052.8705 3063.1469 3089.9131 3098.8323 3099.8059 3105.0605 3121.3780 3148.1878 3485.7088
redmass: 3.8292 1.2291 1.7042 2.1171 1.9146 2.7330 1.2894 1.3540 1.6917 2.4972 2.9457 4.4136 2.2564 2.1761 3.0291 2.9693 2.5613 3.2955 3.4429 4.0884 3.3206 4.1133 4.6365 1.7313 1.7965 9.8293 2.9423 2.5401 1.6317 1.5640 1.7206 1.3080 1.3431 1.9072 1.9316 1.6505 1.8515 1.8715 1.8213 1.7259 2.7932 1.3171 1.2094 1.7037 1.9275 1.7128 1.6300 1.7019 1.2760 1.3044 1.3780 1.3521 1.0774 1.0666 1.0670 1.0644 1.0763 1.0756 1.0720 1.0656 7.4380 6.1398 1.0414 1.0677 1.0410 1.0348 1.0602 1.0955 1.0943 1.0921 1.1030 1.0995 1.1003 1.0951 1.0944 1.0844 1.0961 1.0684
irintensity: 0.2219 0.8090 0.1151 2.9548 1.6317 12.1620 7.3150 87.8956 49.8183 1.8690 2.5637 2.3263 10.9014 1.4249 0.6316 1.8351 0.7321 0.4023 15.4481 1.6170 2.9294 0.9381 1.3002 6.5690 38.4896 40.2310 9.9464 3.6098 2.5290 3.9293 3.4493 1.9550 0.5871 17.4187 4.5837 2.9666 28.5176 3.4860 47.5622 12.5227 4.0930 15.0283 41.4232 4.3191 2.8896 3.1544 2.0891 13.6675 28.1415 21.5470 9.6593 0.7359 10.1264 11.8021 2.6444 10.1477 1.3671 25.5321 4.3216 15.7714 10.4274 45.6511 23.9711 24.7354 74.9820 22.2868 21.1695 6.4846 44.4963 29.8877 29.9086 24.7876 11.9939 33.2188 16.2424 2.0895 31.0367 17.2315
temp: 298.150 k
press: 1.00000 atm
elementType: 8 8 6 6 6 6 6 6 6 6 6 6 1 1 1 1 1 1 1 1 1 1 1 1 1 1 1 1
symmnumber: 1
zpe: 620157.3 jmol-1
zpe.correction: 0.236205 hartree
zpe.thermalcorrener: 0.250192 hartree
zpe.thermalcorrenthalpy: 0.251136 hartree
zpe.thermalcorrgfe: 0.196107 hartree
zpe.sumelectzpe: -540.059492 hartree
zpe.sumelectthermal: -540.045506 hartree
zpe.sumelectthermalent: -540.044561 hartree
zpe.sumelectthermalfe: -540.099590 hartree
dipole: 2.9873 -1.3704 -0.3669
dipole: 3.3071
quadrupole: -76.0833 -69.9784 -71.1538
quadrupole: 3.5524 1.8668 2.6359
quadrupole: -3.6782 2.4268 1.2514 3.5524 1.8668 2.6359
hfenergy: -540.2956974 hartree
pointgroup: C01 [X(C10H16O2)]
dipole: -1.1800246 0.5417114 -0.0833966 debye
polarizability: 193.5065597|-1.0749032|104.9044235|2.3541858|-0.2093817|84.8177882 unknown
InChI: InChI=1S/C10H16O2/c1-8(2)9-4-6-10(3,12-11)7-5-9/h4,6,11H,5,7H2,1-3H3
charge 0 multiplicity 1
28 atoms
O  2.777618 -0.491946 -0.811724
O  3.818407 0.642957 -0.775795
C  1.691396 -0.14988 0.179572
C  0.955658 1.135801 -0.259569
C  -0.461432 1.23532 0.358044
C  -1.32205 0.006675 0.044238
C  0.785212 -1.354336 0.020029
C  2.308326 -0.056954 1.590129
C  -0.576491 -1.256121 -0.067879
C  -2.696109 0.070723 -0.073721
C  -3.484168 1.355714 0.127596
C  -3.582897 -1.116148 -0.418077
H  0.867009 1.112293 -1.363073
H  1.551936 2.023711 0.017629
H  -0.939193 2.156948 -0.016804
H  -0.371904 1.352378 1.458685
H  1.281952 -2.331639 -0.012891
H  1.542114 0.232673 2.330887
H  2.731443 -1.030595 1.891847
H  3.116997 0.694207 1.594173
H  -1.145623 -2.186352 -0.176678
H  -3.810285 1.777131 -0.845857
H  -4.407608 1.150439 0.703315
H  -2.922251 2.137357 0.662726
H  -4.194971 -1.416308 0.456612
H  -4.297423 -0.832889 -1.216081
H  -3.031322 -2.001995 -0.76807
H  3.723361 0.975439 -1.712863
