program: Gaussian 09
title: 000102995
version: EM64L-G09RevD.01
frameworkgroup: C1[X(C14H20N2O6)]
method: RPBEPBE
basis: SDD
operation: Freq
keyword: #p
keyword: freq=noraman
keyword: PBEPBE/SDD
title: #p freq=noraman PBEPBE/SDD
converged: YES YES NO NO
title: Mulliken charges:
elementType: O O O O O O N N C C C C C C C C C C C C C C H H H H H H H H H H H H H H H H H H H H
charge: -0.328896 -0.197218 -0.169522 -0.305114 -0.202733 -0.167194 -0.197985 -0.124414 -0.208983 -0.467443 -0.472264 -0.344755 0.283147 0.325592 0.343906 -0.710072 -0.705153 -0.712905 -0.500104 -0.500525 0.227792 0.203835 0.314843 0.275611 0.238412 0.234772 0.249623 0.229980 0.249617 0.274915 0.207501 0.220123 0.204973 0.226918 0.225145 0.216176 0.208931 0.273273 0.269051 0.270788 0.271453 0.268903
chargesum: 0.00000
title: Mulliken charges with hydrogens summed into heavy atoms:
elementType: O O O O O O N N C C C C C C C C C C C C C C
charge: -0.328896 -0.197218 -0.169522 -0.305114 -0.202733 -0.167194 -0.197985 -0.124414 0.105860 0.046580 0.012130 0.134842 0.283147 0.325592 0.343906 -0.007533 -0.048117 -0.014524 0.039735 0.039831 0.227792 0.203835
polarizability: 2.20509518e+02 1.62206951e+00 1.90541646e+02 3.41495472e+00 5.92372348e+00 1.40958821e+02
1716.lowfreq: -2.9090 -0.0007 -0.0005 -0.0002 5.8056 9.5382 19.0605 20.5290 32.9304
frequency: 18.8098 19.5376 32.8582 45.0405 54.5707 63.6929 74.6401 82.8223 102.6181 112.4733 122.8325 140.3689 157.6212 178.3184 180.3092 218.7859 235.4380 239.4742 249.1220 289.4662 300.2537 308.7564 326.3649 333.9468 348.7407 385.5312 395.3186 435.5270 456.8823 519.7157 534.7942 546.9911 549.4199 564.5918 588.5556 632.8722 640.1997 675.1359 704.1096 707.7851 722.4979 742.6603 785.4849 816.8972 818.5806 860.0224 872.7437 890.0172 913.9458 915.5443 921.6840 953.3083 969.1726 984.0695 998.1601 1006.2374 1018.7474 1028.3898 1032.0815 1033.4231 1041.1273 1074.7905 1105.8257 1147.2788 1159.3470 1160.7806 1172.2992 1180.0380 1196.0549 1209.7274 1229.4014 1233.1296 1255.9636 1257.0594 1269.3789 1293.3280 1295.9627 1302.7630 1324.0101 1333.0273 1340.0091 1370.3599 1371.4888 1376.3133 1397.4654 1436.8651 1444.0021 1452.6598 1465.6180 1467.5742 1469.9305 1470.7206 1478.6168 1479.8523 1494.9726 1502.2998 1618.0681 1657.5490 1703.9131 1734.7182 2988.1355 2989.3855 2994.3930 2996.2988 3022.7308 3025.5917 3029.9281 3038.7677 3058.7947 3069.3307 3079.9759 3083.8837 3084.7577 3091.4727 3095.2279 3096.7347 3101.8891 3105.6674 3113.3533 3117.0451
redmass: 5.4017 5.5761 3.7632 5.5525 4.7791 4.9930 2.6591 3.3663 3.6182 5.0827 5.8270 3.7694 2.7408 1.1586 5.7006 3.6134 1.0860 2.0912 1.0627 6.7761 4.8243 5.0583 4.1261 3.3252 6.0763 6.6454 2.9515 2.9087 2.7630 5.0280 3.5554 3.6598 3.0896 3.8026 4.2425 6.2759 6.8171 4.4545 8.7952 6.6477 7.3224 7.2265 3.8520 3.1719 1.5435 2.4372 3.5695 1.6562 1.5997 2.3616 1.6573 1.2053 2.2032 4.4311 2.9998 2.1832 5.5101 1.4193 2.1673 2.0415 3.7937 1.9585 2.1545 1.1936 1.3904 1.6114 9.8196 2.1385 2.1470 1.1090 1.7932 1.6626 1.9496 3.0210 3.1404 1.6604 2.0866 1.2982 1.3338 1.7998 1.4931 2.8549 1.2658 1.2944 1.2199 1.0741 1.0469 1.0899 1.0602 1.0582 1.0625 1.0824 1.0875 1.0518 1.0875 1.0567 9.7869 12.5498 12.3189 11.7921 1.0361 1.0354 1.0370 1.0641 1.0632 1.0631 1.0593 1.0629 1.0856 1.0989 1.0993 1.0991 1.1038 1.1029 1.0993 1.1001 1.1020 1.1055 1.1002 1.0996
irintensity: 0.2488 0.7131 1.5187 3.2848 1.5598 2.2136 1.6345 1.9844 8.7419 2.5250 1.0041 1.0038 1.4178 0.0144 1.3777 5.7517 0.3522 1.0232 0.1731 1.3051 0.8543 18.3188 1.5684 1.1460 25.7953 8.9031 1.7081 2.0759 1.6607 12.1666 0.1836 2.4304 2.2325 2.2288 13.4239 31.3894 26.6984 2.4381 4.8052 16.8755 6.8217 17.4841 99.1785 26.5517 28.0578 14.2810 56.4363 70.1964 0.8199 17.0008 5.3759 0.3069 3.3392 309.9382 23.9298 2.4981 14.3832 0.0522 30.9932 34.0265 38.5538 74.8578 52.9954 0.7104 32.4642 117.0789 255.4216 106.8188 17.2315 0.0290 38.8300 27.4010 20.9973 25.9615 54.1656 15.9008 31.1857 3.4002 6.4239 110.1735 80.1082 246.9515 54.2621 73.4653 40.0830 0.7457 0.6151 27.1410 10.0707 13.5232 14.1832 13.1590 13.5431 3.6500 5.2977 36.0516 207.0845 589.7077 92.1103 70.3500 24.5662 11.1595 27.9614 47.4177 19.2823 19.9561 11.1216 1.9885 6.4633 13.9683 10.4595 16.8994 0.0307 19.9255 56.3462 37.4816 5.6473 25.1283 4.1195 14.2776
temp: 298.150 k
press: 1.00000 atm
elementType: 8 8 8 8 8 8 7 7 6 6 6 6 6 6 6 6 6 6 6 6 6 6 1 1 1 1 1 1 1 1 1 1 1 1 1 1 1 1 1 1 1 1
symmnumber: 1
zpe: 873367.3 jmol-1
zpe.correction: 0.332648 hartree
zpe.thermalcorrener: 0.355691 hartree
zpe.thermalcorrenthalpy: 0.356635 hartree
zpe.thermalcorrgfe: 0.277551 hartree
zpe.sumelectzpe: -1104.647166 hartree
zpe.sumelectthermal: -1104.624123 hartree
zpe.sumelectthermalent: -1104.623179 hartree
zpe.sumelectthermalfe: -1104.702263 hartree
dipole: 0.8333 2.5106 1.6351
dipole: 3.1098
quadrupole: -93.0388 -133.6318 -129.6951
quadrupole: -7.3846 4.3250 -9.5555
quadrupole: 25.7498 -14.8433 -10.9066 -7.3846 4.3250 -9.5555
hfenergy: -1104.9798141 hartree
pointgroup: C01 [X(C14H20N2O6)]
dipole: 0.3179145 -0.9339662 -0.7235739 debye
polarizability: 220.4361156|-1.401803|189.2760519|-4.1155693|9.8677002|142.2978179 unknown
InChI: InChI=1S/C14H20N2O6/c1-14(2,3)21-13(20)15-8-4-5-9(15)12(19)22-16-10(17)6-7-11(16)18/h9H,4-8H2,1-3H3
charge 0 multiplicity 1
42 atoms
O  -3.494914 -0.070096 -0.244555
O  2.004775 -0.032902 1.016676
O  0.871319 0.167754 -1.057858
O  -1.927663 1.108825 1.10154
O  3.714641 -1.639508 -0.619705
O  3.000485 2.728205 1.003405
N  -1.479697 -1.009402 0.242031
N  3.158525 0.449904 0.339325
C  -0.156582 -1.074847 0.868247
C  0.218652 -2.586657 0.745125
C  -0.494456 -3.0211 -0.561847
C  -1.817092 -2.21382 -0.560662
C  0.870128 -0.230594 0.106923
C  -2.277841 0.104127 0.419871
C  -4.543235 1.038056 -0.20865
C  -3.965324 2.310783 -0.858846
C  -5.672394 0.430763 -1.058755
C  -4.992069 1.268871 1.248291
C  5.095758 0.430118 -0.993037
C  4.860916 1.865443 -0.445918
C  3.952128 -0.425388 -0.444578
C  3.575158 1.810893 0.39113
H  -0.179746 -0.722458 1.912746
H  1.308347 -2.746602 0.719644
H  -0.198335 -3.118772 1.618483
H  -0.674197 -4.108111 -0.598919
H  0.120269 -2.745161 -1.436468
H  -2.645082 -2.768992 -0.080277
H  -2.145655 -1.924406 -1.572558
H  -3.134485 2.715368 -0.260204
H  -4.758217 3.077762 -0.931345
H  -3.600997 2.0927 -1.878344
H  -6.518377 1.138611 -1.118892
H  -5.317356 0.218898 -2.08209
H  -6.032832 -0.511774 -0.611445
H  -5.345003 0.323902 1.698607
H  -5.828223 1.991895 1.264686
H  -4.164532 1.670144 1.854001
H  6.055992 -0.004279 -0.666846
H  5.072197 0.38243 -2.094898
H  4.722945 2.611676 -1.246176
H  5.68477 2.221142 0.195741
