program: Gaussian 09
title: 000102974
version: EM64L-G09RevD.01
frameworkgroup: C1[X(C12H14ClFO2)]
method: RPBEPBE
basis: SDD
operation: Freq
keyword: #p
keyword: freq=noraman
keyword: PBEPBE/SDD
title: #p freq=noraman PBEPBE/SDD
converged: NO YES NO NO
title: Mulliken charges:
elementType: Cl F O O C C C C C C C C C C C C H H H H H H H H H H H H H H
charge: -0.073356 -0.205204 -0.322176 -0.245560 0.175307 -0.454692 -0.387130 0.431707 -0.304676 -0.179750 -0.380306 -0.339143 -0.610320 -0.380337 -0.375041 0.322096 0.206826 0.211895 0.243317 0.203148 0.237160 0.250021 0.223458 0.217989 0.231880 0.272130 0.256501 0.260683 0.256227 0.257347
chargesum: 0.00000
title: Mulliken charges with hydrogens summed into heavy atoms:
elementType: Cl F O O C C C C C C C C C C C C
charge: -0.073356 -0.205204 -0.322176 -0.245560 0.175307 -0.035971 0.059335 0.431707 0.182504 0.261697 -0.148425 -0.067013 -0.093136 -0.124109 -0.117694 0.322096
polarizability: 1.36247283e+02 1.52487270e+01 1.43757328e+02 -1.57977576e+00 3.41756819e+00 1.31680664e+02
1716.lowfreq: -28.5894 -7.6950 -0.0025 -0.0022 -0.0021 7.4045 10.8067 28.3590 44.9761
frequency: -27.5349 28.2851 44.7800 64.1263 79.9796 90.0250 125.7972 144.7003 178.6290 204.6998 236.5920 270.0136 297.1007 353.5510 369.2294 404.4266 413.3859 464.8812 499.7634 522.6933 614.4721 626.6221 674.2904 684.2760 701.6538 739.6248 758.3977 789.1203 809.4734 818.2258 841.2893 866.4641 871.7977 922.3033 942.0641 974.4945 986.9545 1004.8849 1013.9621 1030.2136 1045.6631 1061.2116 1075.9068 1084.0570 1103.9446 1128.0274 1135.7269 1142.9539 1155.4478 1172.8511 1195.7819 1237.1076 1250.8489 1278.0123 1286.9543 1298.8378 1310.8954 1322.9361 1348.3968 1361.6945 1373.6901 1400.7729 1448.5328 1458.6158 1466.7458 1482.1936 1491.0170 1493.2230 1601.1817 1611.8002 2969.6418 2977.8129 2981.3262 3017.5045 3034.4100 3044.6590 3053.9718 3081.8722 3105.0358 3124.6195 3127.3527 3158.6989 3174.2917 3179.1019
redmass: 2.8626 10.5556 4.4052 2.1803 3.9495 5.7034 2.9446 6.5292 5.1420 4.8957 5.0804 3.0283 4.9973 5.7396 4.6662 4.4707 3.0083 3.7668 4.3335 3.0955 5.1002 7.1931 4.3927 7.1011 4.9973 3.0003 1.3728 3.2086 2.2956 1.3332 1.5738 2.5301 2.7250 6.9267 1.3563 1.3992 4.0823 2.7078 2.0337 5.2175 2.3083 1.6904 1.4922 3.1740 1.3127 1.5472 1.8444 1.4658 1.4187 1.3264 2.1991 1.5760 1.3770 1.2986 1.2615 1.1884 1.3235 1.3498 1.2908 1.4282 5.7729 3.8417 1.0891 1.0935 1.0942 1.0924 2.1961 1.1858 7.9072 6.5241 1.0653 1.0590 1.0571 1.0607 1.1000 1.0566 1.1131 1.1041 1.0978 1.0898 1.1110 1.0883 1.0952 1.0970
irintensity: 6.9774 0.8668 1.5805 3.9709 1.0179 5.9823 1.2841 5.5636 5.6249 1.1968 1.7872 4.3086 0.0973 4.9673 2.5643 8.8653 0.0700 5.5296 9.5033 18.0950 27.2427 1.3506 17.6733 6.8496 9.2987 1.7994 14.2003 16.1123 20.0794 8.4084 43.3778 59.3609 32.4099 28.0952 0.2403 0.3636 11.0211 12.8051 22.9273 114.9211 3.2286 13.9067 6.5072 2.2737 8.5969 14.0333 3.4590 13.2156 35.7721 2.4773 32.8634 22.6315 2.1649 12.1056 3.6876 9.9153 23.5014 27.2415 4.2686 4.8685 1.2633 1.7767 2.0303 3.3384 7.6820 9.0455 78.9072 14.5518 6.5066 21.9555 42.1383 62.3957 99.6873 4.9033 21.4792 32.4914 44.2765 8.7700 18.6436 11.9683 25.4231 1.0272 3.4059 2.9803
temp: 298.150 k
press: 1.00000 atm
elementType: 17 9 8 8 6 6 6 6 6 6 6 6 6 6 6 6 1 1 1 1 1 1 1 1 1 1 1 1 1 1
symmnumber: 1
zpe: 617982.3 jmol-1
zpe.correction: 0.235377 hartree
zpe.thermalcorrener: 0.250085 hartree
zpe.thermalcorrenthalpy: 0.251029 hartree
zpe.thermalcorrgfe: 0.191539 hartree
zpe.sumelectzpe: -1174.794463 hartree
zpe.sumelectthermal: -1174.779755 hartree
zpe.sumelectthermalent: -1174.778811 hartree
zpe.sumelectthermalfe: -1174.838302 hartree
dipole: 0.2378 2.7841 2.1630
dipole: 3.5336
quadrupole: -119.9582 -109.6312 -89.4703
quadrupole: 6.7907 5.2404 -1.9325
quadrupole: -13.6049 -3.2780 16.8829 6.7907 5.2404 -1.9325
hfenergy: -1175.0298403 hartree
pointgroup: C01 [X(C12H14Cl1F1O2)]
dipole: -0.5611712 -0.9208481 0.8773849 debye
polarizability: 149.0650932|12.9130607|130.6368071|-0.1060617|-3.4045321|131.9833744 unknown
InChI: InChI=1S/C12H14ClFO2/c13-7-1-6-12(8-15-9-16-12)10-2-4-11(14)5-3-10/h2-5H,1,6-9H2
charge 0 multiplicity 1
30 atoms
Cl -3.523704 3.62701 -0.684987
F  4.288099 1.617315 -0.189385
O  -1.31171 -1.456696 -1.018206
O  -0.315983 -3.271965 0.140126
C  -0.83346 -0.951432 0.30423
C  -1.919999 0.019597 0.824645
C  -0.767963 -2.271795 1.124168
C  0.541246 -0.279162 0.164698
C  -2.136197 1.244518 -0.097694
C  -0.905753 -2.869939 -1.138613
C  1.262827 0.113189 1.321226
C  1.092886 -0.014208 -1.111297
C  -3.263668 2.125362 0.43844
C  2.518109 0.749211 1.214508
C  2.348002 0.620279 -1.242088
C  3.0326 0.985332 -0.072018
H  -1.63446 0.356896 1.841655
H  -2.865389 -0.549996 0.915313
H  -0.021149 -2.26777 1.931555
H  -1.770889 -2.532525 1.521062
H  -1.20615 1.836564 -0.169449
H  -2.383872 0.892842 -1.114714
H  -0.126992 -3.00104 -1.911408
H  -1.818955 -3.451324 -1.371427
H  0.851303 -0.073442 2.320608
H  0.523923 -0.302933 -1.99979
H  -3.039682 2.547146 1.431017
H  -4.235646 1.607935 0.4542
H  3.087488 1.054148 2.097077
H  2.786836 0.829983 -2.22175
