program: Gaussian 09
title: 000102977
version: EM64L-G09RevD.01
frameworkgroup: C1[X(C14H16O3)]
method: RPBEPBE
basis: SDD
operation: Freq
keyword: #pfreq=noraman
keyword: PBEPBE/SDD
title: #p freq=noraman PBEPBE/SDD
converged: YES YES NO NO
title: Mulliken charges:
elementType: O O O C C C C C C C C C C C C C C H H H H H H H H H H H H H H H H
charge: -0.312843 -0.298165 -0.269156 -0.170064 -0.098146 -0.260399 -0.425962 -0.493606 0.541226 -0.454880 -0.412398 -0.053730 -0.372250 -0.355348 -0.350278 0.336034 -0.310299 0.256091 0.237392 0.216320 0.206896 0.228212 0.249999 0.227956 0.229255 0.274534 0.249496 0.222497 0.227299 0.247168 0.246817 0.224705 0.215628
chargesum: 0.00000
title: Mulliken charges with hydrogens summed into heavy atoms:
elementType: O O O C C C C C C C C C C C C C C
charge: -0.312843 -0.298165 -0.269156 0.086028 0.139245 -0.044079 0.009145 -0.015652 0.541226 -0.225625 -0.137865 0.195766 -0.125081 -0.108531 0.099519 0.336034 0.130034
polarizability: 2.27596573e+02 -1.22765386e+00 1.37648548e+02 1.66346441e+00 -2.63433287e+00 1.06365876e+02
1716.lowfreq: -7.4321 -0.0008 -0.0001 0.0005 3.8780 7.4179 29.0150 37.2905 51.2638
frequency: 28.8506 37.1398 51.2097 69.0006 81.8997 104.8434 122.5353 193.6183 204.0783 230.1226 259.3709 305.7123 353.7794 365.8815 405.6994 410.7402 418.5618 479.8909 539.9173 586.0963 598.0366 630.2599 654.5310 734.4567 737.2373 758.8379 778.5130 795.5515 802.3401 819.3978 825.0858 830.0909 841.8742 898.5167 910.2679 916.7109 934.3206 954.6337 966.1396 971.6506 986.5199 1006.0683 1018.5960 1025.0443 1028.6554 1052.4242 1077.0814 1098.1349 1112.7884 1114.9397 1139.8502 1152.4752 1179.1028 1182.1977 1193.4308 1207.9286 1215.4683 1224.2644 1238.4743 1263.0972 1274.6805 1287.8758 1298.6956 1311.7608 1329.3867 1349.9391 1368.0063 1385.7154 1415.6032 1422.3719 1453.1635 1469.4967 1472.8312 1483.4392 1501.0836 1584.6117 1622.2276 2964.3328 2967.4521 2992.4753 3026.9124 3030.4045 3059.8091 3071.6087 3095.4562 3115.2337 3119.0906 3128.7334 3136.8628 3146.8865 3160.2338 3163.8637 3181.4156
redmass: 4.0234 4.2288 4.8003 4.3147 3.8148 4.4155 3.8347 3.1341 4.4169 6.6530 2.8670 3.9415 4.2371 3.6900 4.5203 2.7748 2.7357 4.1758 2.4388 6.5973 5.5706 4.8262 2.4980 4.6401 5.1972 5.7691 5.5915 4.7146 3.9891 3.4004 1.3531 1.5827 1.6585 1.1928 2.8513 2.3402 1.7731 1.4095 2.0713 1.4905 3.0789 2.6475 1.7390 1.4806 1.4395 1.2560 2.4479 1.3609 1.3319 1.3440 1.5524 1.5670 1.3136 1.3211 1.3305 1.5674 1.4081 2.9763 1.4506 1.4332 1.3919 1.3210 1.7707 1.3668 1.7940 1.3780 3.0484 3.7549 2.0395 2.7260 1.0888 1.0963 1.2049 1.1901 2.3509 7.0977 6.3704 1.0557 1.0826 1.0624 1.1069 1.0616 1.0992 1.0531 1.1048 1.0919 1.0894 1.0884 1.0888 1.0988 1.0946 1.0953 1.1192
irintensity: 0.3170 0.0449 1.6566 4.6324 0.8252 6.0959 4.2394 1.5967 4.1599 0.9151 1.1072 15.1313 2.6796 3.7194 3.5530 0.9033 0.8075 8.1413 23.7421 9.3543 4.6137 2.6627 7.1731 0.2175 6.0218 0.8620 13.6020 3.9779 51.0123 14.6331 15.1653 30.0584 41.0390 7.3475 6.3257 6.2890 5.1557 1.7290 12.0844 8.2524 77.9362 11.1774 2.8485 6.8718 0.7021 0.4663 2.3897 4.3375 10.1187 17.0239 1.7114 1.3960 43.9111 77.1648 3.9755 53.4732 1.5829 156.5137 7.9159 1.6234 2.2251 1.7727 6.6797 0.4510 3.3341 15.7719 5.6402 10.0340 4.5508 2.5283 6.3645 10.4872 24.2212 25.3920 150.6391 6.9698 43.1085 32.5685 25.1252 44.2657 28.0922 22.8624 22.0817 24.3496 23.9655 16.1523 18.8815 12.0017 4.4468 43.9496 13.3556 6.9968 31.0087
temp: 298.150 k
press: 1.00000 atm
elementType: 8 8 8 6 6 6 6 6 6 6 6 6 6 6 6 6 6 1 1 1 1 1 1 1 1 1 1 1 1 1 1 1 1
symmnumber: 1
zpe: 702899.4 jmol-1
zpe.correction: 0.267720 hartree
zpe.thermalcorrener: 0.283022 hartree
zpe.thermalcorrenthalpy: 0.283966 hartree
zpe.thermalcorrgfe: 0.223189 hartree
zpe.sumelectzpe: -767.393432 hartree
zpe.sumelectthermal: -767.378131 hartree
zpe.sumelectthermalent: -767.377186 hartree
zpe.sumelectthermalfe: -767.437963 hartree
dipole: 2.2290 2.8034 0.5423
dipole: 3.6224
quadrupole: -91.6044 -103.8107 -97.7782
quadrupole: -2.0980 -2.1992 -1.4423
quadrupole: 6.1267 -6.0796 -0.0471 -2.0980 -2.1992 -1.4423
hfenergy: -767.6611526 hartree
pointgroup: C01 [X(C14H16O3)]
dipole: -0.8556042 -1.0211884 0.5061286 debye
polarizability: 227.4509128|-1.0761521|136.9526673|-4.6270615|-5.2408787|107.2074163 unknown
InChI: InChI=1S/C14H16O3/c1-3-10(15-7-11-8-16-11)4-2-9(1)12-5-6-13-14(12)17-13/h1-4,11-14H,5-8H2
charge 0 multiplicity 1
33 atoms
O  -3.683503 1.573453 -0.740547
O  6.008383 1.35898 -0.336644
O  2.861166 -0.68035 -0.135748
C  -3.656177 0.062268 -0.927177
C  -4.875033 0.710386 -0.34938
C  -2.905811 -0.683328 0.181166
C  -4.930624 0.4165 1.146202
C  -3.483238 -0.042439 1.494187
C  -1.386943 -0.652716 0.077693
C  -0.624479 -1.845055 0.186391
C  -0.692373 0.569225 -0.110078
C  5.062827 0.187321 -0.459372
C  0.781612 -1.826117 0.112657
C  0.716917 0.607279 -0.191055
C  5.951741 0.293204 0.738334
C  1.455538 -0.596513 -0.076673
C  3.600788 0.567372 -0.382634
H  -3.571449 -0.25719 -1.971281
H  -5.781347 0.910251 -0.930522
H  -3.240673 -1.741149 0.124908
H  -5.666826 -0.393188 1.320826
H  -5.246795 1.294471 1.737311
H  -2.867681 0.832107 1.762813
H  -3.450893 -0.749503 2.340364
H  -1.138563 -2.803832 0.329846
H  -1.264564 1.499195 -0.203937
H  5.326866 -0.524979 -1.250874
H  5.524821 0.626654 1.692327
H  6.844074 -0.339849 0.805024
H  1.372088 -2.74373 0.195989
H  1.218417 1.568181 -0.341229
H  3.268745 1.025102 -1.336846
H  3.435289 1.293689 0.438459
