program: Gaussian 09
title: 000102982
version: EM64L-G09RevD.01
frameworkgroup: C1[X(C8HF17O2)]
method: RPBEPBE
basis: SDD
operation: Freq
keyword: #p
keyword: freq=noraman
keyword: PBEPBE/SDD
title: #p freq=noraman PBEPBE/SDD
converged: YES YES NO NO
title: Mulliken charges:
elementType: F F F F F F F F F F F F F F F F F O O C C C C C C C C H
charge: -0.107805 -0.121305 -0.143140 -0.117174 -0.115911 -0.112804 -0.115704 -0.125836 -0.121272 -0.124050 -0.121653 -0.129684 -0.122229 -0.138978 -0.121745 -0.137272 -0.139040 -0.259408 -0.230991 0.183361 0.382846 0.358057 0.380444 0.205570 0.394574 0.029253 0.393344 0.278553
chargesum: 0.00000
title: Mulliken charges with hydrogens summed into heavy atoms:
elementType: F F F F F F F F F F F F F F F F F O O C C C C C C C C
charge: -0.107805 -0.121305 -0.143140 -0.117174 -0.115911 -0.112804 -0.115704 -0.125836 -0.121272 -0.124050 -0.121653 -0.129684 -0.122229 -0.138978 -0.121745 -0.137272 -0.139040 -0.259408 -0.230991 0.183361 0.382846 0.358057 0.380444 0.205570 0.394574 0.307806 0.393344
polarizability: 1.24060031e+02 3.49982325e+00 9.60142344e+01 2.65005973e+00 -1.16428417e+00 9.42393741e+01
1716.lowfreq: -6.9008 -3.3376 0.0005 0.0006 0.0007 3.0699 11.4364 14.5427 16.6156
frequency: 9.0830 14.4862 16.5815 29.3252 38.5129 43.4464 50.0262 60.5067 69.3827 83.6206 94.5241 116.8910 152.5466 165.2496 187.5426 189.0947 195.3065 205.6809 221.6562 228.5653 237.6054 248.2391 266.1640 271.7002 281.5601 293.9223 299.1371 314.6861 318.3280 340.9084 358.3627 389.8048 409.9252 437.7209 449.0832 463.5469 469.4403 477.0994 481.8694 503.2191 515.5912 521.8119 550.9335 571.1191 576.1439 610.9136 632.9996 645.3453 655.6937 708.1863 729.8128 815.7316 879.2437 905.7612 940.7074 979.1922 986.9174 990.0856 995.1431 1022.3795 1030.2144 1042.8201 1050.7259 1053.0069 1057.2248 1064.1217 1074.4224 1083.5170 1093.3617 1103.6544 1176.2307 1194.7582 1203.8757 1211.5217 1217.5196 1301.2180 1359.2368 3077.1903
redmass: 18.3038 17.7761 15.7830 18.1053 18.2688 17.7911 16.4218 17.5918 16.4042 17.8853 17.8855 17.5460 17.1010 16.7296 16.6083 17.4177 15.9445 18.5744 16.6515 17.1656 18.4114 18.0816 18.5329 18.4456 18.5087 18.2617 18.5145 18.4944 17.7048 17.8914 14.3295 17.2643 15.4178 16.5033 16.8136 17.6427 17.4871 16.1597 13.0153 16.4981 16.2272 15.8150 15.4312 17.1967 14.8115 14.3316 15.5821 15.9488 17.2769 16.4302 15.6552 6.2898 12.0245 13.3512 9.1419 12.6168 10.1277 11.9111 12.6866 12.5454 12.8250 12.5817 9.2991 12.8805 10.6805 11.6879 12.8882 13.2259 12.8960 11.6179 12.3629 12.4282 10.9069 9.3709 5.6253 1.1849 1.5161 1.0875
irintensity: 0.0638 0.0021 0.4527 0.0376 0.2206 0.0980 0.1238 0.0595 0.4590 0.0166 0.3690 0.0840 4.1284 0.6494 1.6796 3.7122 2.0346 1.7114 6.4905 1.3919 2.8229 0.1044 3.8444 0.4839 0.8159 0.8445 0.3111 0.0836 0.2069 0.6430 3.1762 8.5863 6.2400 12.0037 10.7990 0.8765 5.1868 8.1355 17.7125 7.3722 6.9385 2.8063 7.0136 18.5242 31.1536 10.2013 41.3194 7.4949 36.0136 38.4797 3.8225 21.5283 68.6442 252.9976 143.0402 13.3601 72.9569 145.1207 27.0128 35.1637 94.0730 167.8887 67.5214 35.4944 363.3964 310.9890 81.9281 296.9391 489.8778 973.2722 83.5862 46.9478 61.5771 102.6702 9.2158 1.6743 11.6709 4.6539
temp: 298.150 k
press: 1.00000 atm
elementType: 9 9 9 9 9 9 9 9 9 9 9 9 9 9 9 9 9 8 8 6 6 6 6 6 6 6 6 1
symmnumber: 1
zpe: 281796.4 jmol-1
zpe.correction: 0.107331 hartree
zpe.thermalcorrener: 0.134365 hartree
zpe.thermalcorrenthalpy: 0.135309 hartree
zpe.thermalcorrgfe: 0.044719 hartree
zpe.sumelectzpe: -2151.053039 hartree
zpe.sumelectthermal: -2151.026005 hartree
zpe.sumelectthermalent: -2151.025061 hartree
zpe.sumelectthermalfe: -2151.115651 hartree
dipole: 0.5131 -1.4650 0.3835
dipole: 1.5990
quadrupole: -156.3503 -149.2922 -153.6485
quadrupole: -5.7297 0.8746 -1.9161
quadrupole: -3.2533 3.8048 -0.5515 -5.7297 0.8746 -1.9161
hfenergy: -2151.16037 hartree
pointgroup: C01 [X(C8H1F17O2)]
dipole: 0.184998 0.5804964 0.1566438 debye
polarizability: 124.1970724|-0.9792064|96.5073729|-3.7912457|0.0572555|93.609194 unknown
InChI: InChI=1S/C8HF17O2/c9-1(2(10,11)12)26-8(24,25)4(15,6(19,20)21)27-7(22,23)3(13,14)5(16,17)18/h1H
charge 0 multiplicity 1
28 atoms
F  0.399073 -1.197966 1.545089
F  0.679584 1.273978 -1.133494
F  0.970605 1.43491 1.108497
F  -1.719405 1.922677 0.379797
F  -1.641024 0.594002 2.212892
F  1.534372 -2.545798 -0.522955
F  -0.703599 -2.80661 -0.645659
F  0.348015 -1.408872 -2.093238
F  -3.775676 -0.900045 1.405014
F  -4.220061 1.337865 1.265656
F  -3.591833 -1.135317 -1.324684
F  -3.569983 1.117656 -1.618734
F  -5.417436 0.09116 -0.788783
F  3.713677 1.21627 -1.678285
F  5.089604 -0.776332 -0.143782
F  5.779107 1.355493 0.234938
F  4.477649 0.294917 1.766453
O  -1.261086 -0.360683 0.093832
O  2.396368 0.058522 -0.115905
C  0.125272 -0.690975 0.241998
C  1.087707 0.532448 0.005744
C  -1.968156 0.610021 0.842839
C  0.334283 -1.882164 -0.774557
C  -3.497003 0.277416 0.681563
C  -4.019548 0.080863 -0.789528
C  3.449743 1.041026 -0.291203
C  4.711012 0.454781 0.389577
H  3.184539 2.018857 0.14822
