program: Gaussian 09
title: 000102972
version: EM64L-G09RevD.01
frameworkgroup: C1[X(C14H22O)]
method: RPBEPBE
basis: SDD
operation: Freq
keyword: #pfreq=noraman
keyword: PBEPBE/SDD
title: #p freq=noraman PBEPBE/SDD
converged: YES YES NO NO
title: Mulliken charges:
elementType: O C C C C C C C C C C C C C C H H H H H H H H H H H H H H H H H H H H H H
charge: -0.436961 -0.194811 -0.425894 -0.370576 -0.392683 0.530719 -0.346005 -0.359978 -0.705381 -0.433913 -0.381243 -0.697449 -0.386297 -0.367509 0.275025 0.192355 0.190715 0.193973 0.180948 0.214341 0.197426 0.197470 0.187843 0.184346 0.198016 0.193934 0.204400 0.234702 0.212747 0.231806 0.230047 0.214727 0.210253 0.208893 0.215878 0.246746 0.351391
chargesum: 0.00000
title: Mulliken charges with hydrogens summed into heavy atoms:
elementType: O C C C C C C C C C C C C C C
charge: -0.085570 -0.002457 -0.041205 0.024712 0.002213 0.530719 0.026183 0.031972 -0.053532 -0.202107 -0.151196 -0.063577 -0.170419 -0.120763 0.275025
polarizability: 1.60787403e+02 2.32235025e+01 1.59367831e+02 -3.11861407e+00 -1.62141149e+00 1.38503982e+02
1716.lowfreq: -18.7142 -5.2886 -0.0007 -0.0005 0.0005 6.8389 25.0061 32.8484 36.9295
frequency: 23.7798 32.3150 36.8797 61.3679 76.7244 96.5718 118.8051 129.3747 166.9665 176.4396 199.8718 229.3344 242.4554 266.0020 311.1264 339.9539 346.2407 386.1055 409.5112 414.0422 461.6501 486.9448 527.8857 555.9171 635.3735 679.2672 721.1280 729.2075 750.6929 790.9339 806.6901 813.2639 832.9595 850.3485 885.5051 902.1630 932.5664 954.8865 957.7903 990.0870 1002.9021 1014.6846 1034.2631 1059.4004 1073.2846 1076.1966 1086.6561 1101.7112 1116.5380 1136.0368 1144.4945 1178.6703 1198.1186 1202.7516 1230.5553 1245.1760 1247.8766 1253.6910 1273.3344 1285.6888 1288.7941 1303.7045 1311.4283 1327.9815 1343.7041 1350.8456 1355.1933 1386.1262 1388.3296 1391.7912 1426.1697 1456.9328 1462.0411 1467.0588 1471.4859 1474.9756 1476.6593 1479.2154 1485.1909 1487.2839 1502.6341 1596.6706 1625.0580 2949.1495 2951.1176 2953.2828 2959.3122 2966.7449 2968.8828 2970.9253 2974.4499 2989.0198 3000.7134 3015.8857 3020.8541 3038.5777 3066.3186 3067.2783 3069.8345 3078.8113 3106.4475 3123.9238 3133.4943 3165.5148 3582.8808
redmass: 2.5448 2.7583 2.6305 2.9250 3.3504 2.5072 1.7403 2.5474 3.2678 2.1662 2.9067 1.1150 1.3388 4.0585 3.2226 3.2819 1.1600 3.7244 3.1678 3.4259 3.4251 3.1289 2.9052 2.3215 6.8796 2.7359 1.1867 2.0701 1.2942 1.3906 1.5419 2.5851 1.5656 1.3387 1.9207 1.8892 1.3798 1.3215 1.3480 3.2148 2.7884 2.5770 1.6902 2.1692 2.1554 1.8544 1.8669 2.0056 1.8569 1.9750 1.4753 1.1135 1.6084 1.9585 1.3257 2.3453 1.4130 1.3223 1.1892 1.0945 1.1435 1.2977 1.3148 1.4553 1.4529 1.5941 1.5419 1.2384 1.2168 4.6043 2.6223 1.0767 1.0720 1.0751 1.0757 1.0426 1.0427 1.0775 1.0621 1.0855 2.7292 6.3282 6.4957 1.0610 1.0729 1.0651 1.0613 1.0590 1.0601 1.0367 1.0378 1.0957 1.0993 1.1020 1.1020 1.1038 1.0993 1.1007 1.0992 1.0998 1.0875 1.0889 1.0958 1.0952 1.0660
irintensity: 0.0626 0.4488 0.7917 0.0251 0.1395 0.0318 0.0065 0.2349 0.1287 0.3657 0.2511 0.0020 0.0537 0.1393 0.0822 5.1219 139.8000 9.0759 2.5675 2.3646 2.2380 7.4294 3.1736 26.5418 0.3277 22.1412 4.6575 3.9756 2.5641 2.9363 24.1995 9.1108 43.5297 9.9521 7.8200 1.6318 0.1307 0.7536 0.2359 0.6557 2.4945 0.2445 0.9676 2.7579 8.0756 8.4811 12.7483 8.0141 15.3688 97.2538 142.4056 4.5636 0.5971 1.0661 3.8416 19.9354 9.3620 1.0943 0.1587 0.9234 0.0212 10.8310 6.1065 3.3885 5.1457 1.7391 0.2083 15.4309 10.8338 14.1622 11.6008 0.3026 0.0869 2.2046 2.8333 9.0496 12.1949 3.4444 6.5874 19.1338 91.6958 11.1040 29.5521 3.1907 12.6894 0.3733 11.8823 21.8371 155.2522 40.0996 28.6890 5.0011 4.5553 11.9966 14.0713 113.6401 46.1758 98.2358 52.3684 56.9538 20.4467 17.6197 15.8973 6.7261 35.9025
temp: 298.150 k
press: 1.00000 atm
elementType: 8 6 6 6 6 6 6 6 6 6 6 6 6 6 6 1 1 1 1 1 1 1 1 1 1 1 1 1 1 1 1 1 1 1 1 1 1
symmnumber: 1
zpe: 851166.1 jmol-1
zpe.correction: 0.324192 hartree
zpe.thermalcorrener: 0.341367 hartree
zpe.thermalcorrenthalpy: 0.342312 hartree
zpe.thermalcorrgfe: 0.277368 hartree
zpe.sumelectzpe: -620.739671 hartree
zpe.sumelectthermal: -620.722495 hartree
zpe.sumelectthermalent: -620.721551 hartree
zpe.sumelectthermalfe: -620.786495 hartree
dipole: 0.2029 0.3185 1.5771
dipole: 1.6217
quadrupole: -95.7463 -92.1756 -88.1558
quadrupole: 3.9964 -6.3776 -5.4924
quadrupole: -3.7204 -0.1497 3.8701 3.9964 -6.3776 -5.4924
hfenergy: -621.0638628 hartree
pointgroup: C01 [X(C14H22O1)]
dipole: -0.0776773 0.1209182 -0.6216337 debye
polarizability: 160.7829177|-23.2506808|159.4138791|-2.8774515|1.3961336|138.4624192 unknown
InChI: InChI=1S/C14H22O/c1-3-5-6-7-12(4-2)13-8-10-14(15)11-9-13/h8-12,15H,3-7H2,1-2H3
charge 0 multiplicity 1
37 atoms
O  3.565264 -2.935552 0.317672
C  0.070787 1.646319 -0.248731
C  -1.341009 1.374319 0.350581
C  -2.128877 0.253721 -0.36301
C  0.697142 2.920337 0.39337
C  0.992798 0.430871 -0.122602
C  -3.520244 0.003269 0.261069
C  -4.320579 -1.108371 -0.455425
C  2.017279 3.368744 -0.268426
C  1.525469 -0.210373 -1.266998
C  1.349136 -0.091393 1.151162
C  -5.703494 -1.363301 0.182226
C  2.382246 -1.330198 -1.158736
C  2.200551 -1.205307 1.282021
C  2.718866 -1.826146 0.121891
H  -0.063164 1.856231 -1.331964
H  -1.927632 2.315718 0.307771
H  -1.240044 1.121355 1.426821
H  -2.249809 0.517597 -1.435235
H  -1.541264 -0.685574 -0.33748
H  0.867695 2.73589 1.473599
H  -0.044512 3.742615 0.331852
H  -3.397831 -0.268765 1.330707
H  -4.108792 0.945039 0.246167
H  -3.72831 -2.046152 -0.444672
H  -4.448146 -0.834404 -1.52282
H  1.865493 3.595317 -1.341245
H  2.786834 2.579225 -0.197505
H  2.416827 4.279144 0.215199
H  1.268377 0.169797 -2.263164
H  0.955446 0.378883 2.060351
H  -6.255859 -2.160001 -0.349574
H  -5.60066 -1.671972 1.239901
H  -6.325312 -0.448167 0.160322
H  2.781394 -1.808195 -2.063442
H  2.474041 -1.60595 2.262896
H  3.873091 -3.297172 -0.550146
