program: Gaussian 09
title: 000102965
version: EM64L-G09RevD.01
frameworkgroup: C1[X(C10H18O2)]
method: RPBEPBE
basis: SDD
operation: Freq
keyword: #pfreq=noraman
keyword: PBEPBE/SDD
title: #p freq=noraman PBEPBE/SDD
converged: YES YES NO NO
title: Mulliken charges:
elementType: O O C C C C C C C C C C H H H H H H H H H H H H H H H H H H
charge: -0.240068 -0.206414 0.369725 -0.469810 -0.501906 -0.388757 -0.564571 -0.013227 -0.742102 0.181625 -0.714639 -0.717210 0.229244 0.220463 0.233912 0.240331 0.201294 0.201987 0.253475 0.264191 0.197484 0.225644 0.219386 0.242608 0.223676 0.202389 0.215642 0.205715 0.216797 0.213116
chargesum: 0.00000
title: Mulliken charges with hydrogens summed into heavy atoms:
elementType: O O C C C C C C C C C C
charge: -0.240068 -0.206414 0.369725 -0.020103 -0.027663 0.014525 -0.046906 0.184257 -0.054464 0.181625 -0.072932 -0.081582
polarizability: 1.38880307e+02 7.49931401e+00 1.00823140e+02 -7.52078293e-01 7.10485366e-01 9.60273720e+01
1716.lowfreq: -8.5122 -0.0009 0.0002 0.0007 7.4687 14.7322 35.3969 51.2962 73.4043
frequency: 35.2952 50.9940 73.3713 113.5088 136.4210 146.2587 198.0531 222.9240 231.0999 243.6647 261.7020 323.6270 347.9465 378.2600 391.4498 429.6170 460.0314 503.0877 509.4527 620.8137 637.1191 748.1966 759.4482 778.8673 823.9469 854.3715 885.6358 914.0768 926.5491 941.1019 953.8586 962.0328 994.1089 1014.4159 1051.7187 1059.3075 1074.8317 1107.9842 1121.7804 1135.3468 1176.1526 1189.6722 1210.3568 1244.1097 1253.0704 1270.5261 1278.0897 1311.0063 1316.0444 1324.0606 1334.6368 1352.4004 1378.8139 1393.3660 1395.6092 1446.6691 1454.0189 1466.3992 1467.5717 1470.5502 1473.5912 1476.9042 1480.3625 1483.3831 1491.0171 1697.5575 2952.9475 2961.9897 2966.3944 2971.2041 2988.1004 2990.8960 3010.5072 3014.3355 3016.8519 3052.9290 3057.7857 3065.8420 3070.4873 3074.9414 3082.8957 3085.3157 3096.6158 3100.2821
redmass: 2.6050 4.1017 3.9908 2.0901 3.1708 2.1731 1.1393 1.5883 1.3370 1.3154 2.9169 2.2919 2.4602 2.5933 2.2481 2.4657 3.0401 3.2833 2.8337 5.3690 3.8368 3.7081 1.3188 2.1675 2.3743 4.4480 2.2765 1.1840 1.6423 1.7844 1.4191 1.6071 2.0384 2.0542 2.0743 1.9112 2.1110 3.2456 1.3255 2.2811 1.7889 1.8898 1.4320 2.1130 1.6117 1.3559 1.3189 1.6115 1.3825 1.5529 1.4114 1.5533 1.2162 1.2223 1.2177 1.0782 1.0724 1.0590 1.0683 1.0569 1.0714 1.0654 1.0606 1.0715 1.0493 12.5696 1.0668 1.0738 1.0359 1.0382 1.0577 1.0383 1.0959 1.0644 1.0673 1.1026 1.0990 1.0986 1.0994 1.0987 1.1002 1.0993 1.0995 1.1000
irintensity: 0.9463 0.5854 2.9565 0.2446 0.0353 3.0319 0.2937 0.0185 0.3681 0.2350 2.3500 0.2741 0.4838 1.9660 0.1024 0.5251 3.7048 6.7071 1.9189 11.8567 0.8914 2.1980 2.0410 5.9934 1.2665 97.3120 17.1590 4.6893 7.0427 7.2059 1.8804 1.8368 2.6467 31.3449 1.3360 2.2127 118.4689 151.3715 10.2201 3.7505 12.7849 1.4355 1.4087 40.5332 10.0242 2.8212 4.9693 19.4116 3.9567 15.2704 1.2565 0.1160 20.7663 23.1273 21.0891 13.8244 2.1047 7.0996 7.2980 6.5162 5.0905 7.8731 8.0028 1.8360 29.6508 378.0937 8.2299 24.9169 39.6702 27.6617 29.6710 8.5676 12.4972 31.1329 4.7704 25.0263 20.7868 86.0790 44.5950 61.7634 14.2316 34.3453 21.3195 16.2266
temp: 298.150 k
press: 1.00000 atm
elementType: 8 8 6 6 6 6 6 6 6 6 6 6 1 1 1 1 1 1 1 1 1 1 1 1 1 1 1 1 1 1
symmnumber: 1
zpe: 686767.4 jmol-1
zpe.correction: 0.261576 hartree
zpe.thermalcorrener: 0.275318 hartree
zpe.thermalcorrenthalpy: 0.276263 hartree
zpe.thermalcorrgfe: 0.220973 hartree
zpe.sumelectzpe: -541.353606 hartree
zpe.sumelectthermal: -541.339863 hartree
zpe.sumelectthermalent: -541.338919 hartree
zpe.sumelectthermalfe: -541.394208 hartree
dipole: 3.9439 2.4804 2.9058
dipole: 5.4910
quadrupole: -91.3331 -74.7576 -74.7741
quadrupole: -8.7405 -9.9461 -2.4966
quadrupole: -11.0449 5.5307 5.5142 -8.7405 -9.9461 -2.4966
hfenergy: -541.6151815 hartree
pointgroup: C01 [X(C10H18O2)]
dipole: -1.5587083 -0.9786857 1.1311745 debye
polarizability: 139.1882059|6.6780512|100.571656|0.4565368|-0.6605881|95.9709562 unknown
InChI: InChI=1S/C10H18O2/c1-8(2)4-6-10(3)7-5-9(11)12-10/h8H,4-7H2,1-3H3
charge 0 multiplicity 1
30 atoms
O  1.747284 0.233919 -0.964581
O  3.89609 1.012494 -0.549841
C  0.663218 -0.52584 -0.209531
C  -0.664283 0.139451 -0.620321
C  1.045178 -0.30367 1.2872
C  -1.907299 -0.430306 0.102208
C  2.574974 -0.10132 1.26401
C  -3.237685 0.271489 -0.288429
C  0.77671 -1.997314 -0.644407
C  2.866727 0.452962 -0.137259
C  -3.27749 1.751535 0.163534
C  -4.441156 -0.503976 0.298521
H  -0.568272 1.222846 -0.417773
H  -0.791897 0.029142 -1.715137
H  0.730503 -1.152054 1.916567
H  0.547054 0.607353 1.665268
H  -2.005958 -1.510307 -0.128245
H  -1.779155 -0.351459 1.202386
H  3.129349 -1.05102 1.381471
H  2.953033 0.595591 2.028226
H  -3.319404 0.247004 -1.396486
H  1.759135 -2.419813 -0.366917
H  -0.006955 -2.610278 -0.16505
H  0.667172 -2.079858 -1.739379
H  -2.476915 2.353181 -0.302836
H  -3.165054 1.825814 1.26315
H  -4.24289 2.217629 -0.10725
H  -4.397363 -0.515881 1.405127
H  -5.399252 -0.036249 0.005638
H  -4.454098 -1.553565 -0.050862
