program: Gaussian 09
title: 000102957
version: EM64L-G09RevD.01
frameworkgroup: C1[X(C8H16O)]
method: RPBEPBE
basis: SDD
operation: Freq
keyword: #pfreq=noraman
keyword: PBEPBE/SDD
title: #p freq=noraman PBEPBE/SDD
converged: YES YES NO NO
title: Mulliken charges:
elementType: O C C C C C C C C H H H H H H H H H H H H H H H H
charge: -0.307134 -0.072617 -0.061020 -0.420455 -0.372805 -0.701914 -0.345248 -0.355782 -0.693316 0.219397 0.217618 0.211919 0.206770 0.191852 0.199838 0.230198 0.212331 0.230097 0.192463 0.189460 0.195485 0.195467 0.210502 0.216202 0.210693
chargesum: 0.00000
title: Mulliken charges with hydrogens summed into heavy atoms:
elementType: O C C C C C C C C
charge: -0.307134 0.146780 0.156598 -0.001766 0.018885 -0.029288 0.036674 0.035170 -0.055920
polarizability: 1.10062053e+02 3.76241034e+00 8.14260478e+01 -2.57953667e+00 -1.37729474e+00 7.58840720e+01
1716.lowfreq: -0.0011 -0.0008 -0.0005 9.0927 9.7954 22.0639 46.4766 59.5875 79.0794
frequency: 46.3241 58.7350 78.8590 114.0885 136.2411 175.2715 187.8990 231.4377 267.6655 287.8787 317.9687 414.0863 479.2492 479.8817 698.5528 724.2877 745.4180 782.8074 842.6247 884.1466 909.9649 951.1787 996.0145 1000.8372 1015.2423 1051.3428 1071.2136 1085.6183 1108.8997 1125.7883 1129.3624 1163.4284 1200.9025 1231.5523 1242.8300 1258.7734 1289.5647 1290.5032 1300.7257 1324.5850 1346.1009 1356.7798 1391.6881 1393.2064 1437.0531 1463.5322 1464.2251 1465.9528 1471.9099 1474.1833 1477.8260 1481.3562 1488.5150 2955.3319 2960.1203 2969.1177 2973.4484 2981.5696 2982.1208 2992.2591 3008.4140 3029.3586 3044.3916 3060.9773 3068.9706 3070.3250 3072.4428 3072.9521 3096.5372
redmass: 3.3418 1.8999 2.7419 2.4106 1.8301 2.8267 1.1032 1.1188 2.7663 3.0688 2.9297 3.0454 2.9196 3.7720 5.3013 1.0741 1.2744 2.0666 1.4528 1.9363 2.0332 1.2004 1.5536 1.5460 1.7652 2.5959 2.2057 1.9467 1.7902 2.5442 1.6233 2.0464 1.5196 1.3227 1.2972 1.2723 1.0529 1.1685 1.2764 1.2321 1.4858 1.6424 1.2171 1.2374 1.9220 1.0774 1.0803 1.2655 1.0747 1.0943 1.0423 1.0772 1.0894 1.0589 1.0591 1.0591 1.0364 1.0380 1.0585 1.0974 1.1011 1.1028 1.1001 1.0936 1.0923 1.0996 1.0993 1.0971 1.0986
irintensity: 1.5377 0.1016 1.9683 0.7299 0.0140 1.4869 0.1726 0.0042 0.8838 0.9747 2.9253 3.8780 2.8681 11.2891 6.4615 11.6447 3.8480 15.4138 10.7522 10.4809 3.2620 5.2213 7.2544 4.3356 7.7014 7.5637 7.9224 5.3581 13.6844 2.9068 2.8820 1.0081 0.6120 2.2972 0.7844 1.6751 0.3900 0.2645 1.4321 7.7183 0.1678 0.4405 11.3832 19.7186 6.6481 1.1995 0.7054 12.6869 2.3909 9.8320 12.7057 3.7913 23.5085 0.7783 4.1479 80.0046 34.5592 44.0633 36.3488 0.8143 0.1515 17.5463 50.3311 14.5375 14.2061 121.8366 52.8282 34.0944 51.5489
temp: 298.150 k
press: 1.00000 atm
elementType: 8 6 6 6 6 6 6 6 6 1 1 1 1 1 1 1 1 1 1 1 1 1 1 1 1
symmnumber: 1
zpe: 584689.3 jmol-1
zpe.correction: 0.222696 hartree
zpe.thermalcorrener: 0.234190 hartree
zpe.thermalcorrenthalpy: 0.235134 hartree
zpe.thermalcorrgfe: 0.184733 hartree
zpe.sumelectzpe: -388.879905 hartree
zpe.sumelectthermal: -388.868412 hartree
zpe.sumelectthermalent: -388.867467 hartree
zpe.sumelectthermalfe: -388.917868 hartree
dipole: -1.6014 2.1661 0.1493
dipole: 2.6979
quadrupole: -63.5143 -60.1409 -55.2711
quadrupole: 8.2648 -0.2327 -1.0650
quadrupole: -3.8722 -0.4988 4.3710 8.2648 -0.2327 -1.0650
hfenergy: -389.1026012 hartree
pointgroup: C01 [X(C8H16O1)]
dipole: 0.6391872 -0.8425708 0.0905273 debye
dipolederiv: -0.7134482 0.1145586 0.0139431 0.1100388 -0.6392862 0.0491126 -0.0218931 0.0355094 -0.3109679 0.4702349 0.0332006 -0.0052006 -0.0144919 0.1599567 -0.0719145 -0.0990454 -0.0082574 0.2772591 0.2656913 0.0460613 -0.0851402 0.1556079 0.3821812 0.0180966 -0.0430592 -0.0565976 0.2598382 -0.1336757 0.0271979 0.0303426 -0.0293511 0.1001689 0.0565716 0.035641 0.0224427 0.0894551 -0.0434708 0.0057071 0.0184137 -0.0345784 0.0744166 0.0216915 0.0596452 0.0370643 0.1727037 -0.0484097 -0.1155203 0.0616457 -0.0944348 -0.0576161 0.0355772 0.0247659 0.0301358 0.0063524 -0.0192878 0.0251686 0.0141214 0.0792701 0.0964127 0.0442119 -0.0138254 0.0368546 0.1599808 0.0117461 0.0071226 0.014476 -0.0389459 0.1123696 0.0246868 0.0403149 0.0265194 0.1615359 -0.0806842 -0.0166765 0.0286767 0.0238711 0.067917 0.0135113 0.0131276 0.0146273 0.0855324 -0.0135821 -0.0176165 0.0089348 -0.0266136 0.0721385 0.0603186 0.0079472 0.0601308 -0.143991 0.040946 -0.0180439 0.1002449 -0.043792 0.0027688 -0.0155377 0.0956329 -0.0424566 -0.12215 0.0094871 -0.0660802 -0.032581 -0.0555686 -0.1183173 -0.0790224 -0.0122127 -0.1004729 0.0390224 0.043881 0.0092984 -0.0128174 0.0103635 0.0685274 0.014059 0.0000581 0.0605813 -0.1416802 0.0498913 0.0062485 0.0043556 -0.0010793 0.045953 0.0513442 0.0070659 0.0739344 -0.1760435 0.0394799 -0.0351244 -0.0186267 -0.0425966 -0.1370575 -0.0774925 -0.0222271 -0.1037064 0.0174087 -0.1145913 -0.0537817 -0.1035875 -0.0108708 0.0838597 0.0109338 -0.1199399 0.0126261 0.0263199 0.045799 0.0869578 0.0068203 0.0431916 -0.1386275 -0.009159 0.0249791 -0.0009062 0.1042723 0.086371 -0.0193771 0.0230745 0.0114832 0.0800729 -0.0684829 0.076068 -0.0180148 -0.1115578 0.0354964 0.0096857 -0.0066094 0.001875 0.0436328 0.0529749 0.0084491 0.0774653 -0.1782263 0.0258348 -0.0329434 -0.0159372 -0.0415625 -0.1438868 -0.085365 -0.0213867 -0.1103741 0.0175576 0.0303827 -0.0020265 0.0334361 0.0091497 0.0503775 0.0512326 0.0070408 0.0851914 -0.1897122 0.0137275 -0.0714153 -0.0303105 -0.0365655 -0.1447389 -0.0853663 -0.0254271 -0.1141667 0.0234045 0.0729399 -0.0062635 -0.0218113 -0.0314652 0.0769252 0.0537243 0.0441927 0.0575736 -0.1763951 -0.1369138 0.1169943 -0.0241095 0.1546413 -0.0261875 0.0365049 -0.0372615 0.0407898 0.0867193 0.0621547 -0.0333321 -0.0017541 -0.0975763 -0.1119607 -0.1022115 -0.0286505 -0.1164934 0.0233617 unknown
polarizability: 110.0046185|4.1630073|81.6124575|2.2282067|1.1461846|75.7550972 unknown
InChI: InChI=1S/C8H16O/c1-3-4-5-6-8-7(2)9-8/h7-8H,3-6H2,1-2H3
charge 0 multiplicity 1
25 atoms
O  -2.901779 1.098969 -0.109075
C  -1.688456 0.384874 0.459242
C  -2.629682 -0.35864 -0.441424
C  -0.33075 0.875359 -0.005669
C  0.795822 -0.140841 0.306125
C  -3.640263 -1.35958 0.075976
C  2.193562 0.366409 -0.114023
C  3.323671 -0.643887 0.188129
C  4.717504 -0.130532 -0.233561
H  -1.783324 0.192874 1.539851
H  -2.308571 -0.491921 -1.48585
H  -0.104384 1.842992 0.485672
H  -0.372026 1.075475 -1.093972
H  0.801133 -0.366868 1.39292
H  0.580869 -1.098733 -0.210784
H  -4.56208 -1.339942 -0.53304
H  -3.226526 -2.385434 0.039721
H  -3.915897 -1.129365 1.119806
H  2.189836 0.598074 -1.199569
H  2.408695 1.323074 0.406382
H  3.325726 -0.874135 1.273205
H  3.106905 -1.599486 -0.331774
H  4.750869 0.079352 -1.319373
H  5.507393 -0.870378 -0.007978
H  4.971452 0.806989 0.296263
