program: Gaussian 09
title: 000102952
version: EM64L-G09RevD.01
frameworkgroup: C1[X(C12H12O3)]
method: RPBEPBE
basis: SDD
operation: Freq
keyword: #pfreq=noraman
keyword: PBEPBE/SDD
title: #p freq=noraman PBEPBE/SDD
converged: YES YES NO NO
title: Mulliken charges:
elementType: O O O C C C C C C C C C C C C H H H H H H H H H H H H
charge: -0.294585 -0.291618 -0.250337 -0.040150 -0.346943 -0.289592 0.190544 0.225020 -0.360265 -0.344503 0.490662 -0.392823 -0.373694 -0.198318 -0.560019 0.247499 0.222869 0.226351 0.249771 0.235785 0.270887 0.267282 0.233965 0.227334 0.219274 0.220660 0.214944
chargesum: 0.00000
title: Mulliken charges with hydrogens summed into heavy atoms:
elementType: O O O C C C C C C C C C C C C
charge: -0.294585 -0.291618 -0.250337 0.207349 0.102277 0.195964 0.190544 0.225020 -0.089378 -0.077222 0.490662 -0.158858 -0.146360 0.020956 -0.124415
polarizability: 2.35642878e+02 2.58847516e+01 1.49578238e+02 1.56641547e+00 1.13799807e+00 7.05438201e+01
1716.lowfreq: -1.7008 0.0005 0.0006 0.0006 5.9976 9.5638 19.6912 36.5427 55.4959
frequency: 19.6322 36.5353 55.4766 63.0891 69.2578 108.8533 151.6690 174.1021 237.5804 241.1388 282.2748 292.7641 383.0684 397.9393 408.0444 457.2395 479.1090 514.9112 601.1883 633.5513 639.5736 692.6199 725.4601 769.2506 781.3039 793.8773 816.9031 853.1506 876.7004 886.7695 913.3313 941.9182 970.2105 987.3439 996.1974 1007.6953 1013.4414 1027.8069 1031.5533 1056.5737 1096.7619 1112.7217 1125.0659 1140.1890 1186.4503 1200.4623 1220.6636 1236.2513 1249.3800 1294.3732 1321.7640 1337.7108 1377.8640 1412.6968 1419.0088 1437.9982 1467.4337 1481.8995 1502.4689 1565.1915 1618.3368 1620.7730 1643.6205 3018.0536 3070.4538 3082.5607 3092.7839 3105.3978 3114.7551 3129.4411 3143.3663 3162.8184 3176.4487 3179.7713 3206.8699
redmass: 3.3274 4.3395 4.0815 4.4377 4.7777 3.1729 4.0007 4.2818 5.9171 3.8245 3.6818 5.6833 4.4234 2.3893 2.7783 2.5413 4.0271 5.5301 4.1401 6.9410 2.2944 2.6784 6.4899 5.3840 3.3502 4.4117 7.1266 1.3046 1.7015 1.1707 6.3803 1.3373 1.8862 1.3596 1.3581 3.3198 1.2005 1.4064 1.5097 5.1490 1.3803 1.3366 1.3973 1.5340 1.1853 1.3014 2.2265 1.4930 3.1389 1.3658 1.3188 1.4702 3.8252 2.0430 3.9054 1.2794 1.1279 1.1874 2.5742 6.8128 7.5133 8.6364 4.3418 1.0575 1.0531 1.1058 1.0769 1.0754 1.0933 1.0893 1.0887 1.0953 1.0956 1.1192 1.1141
irintensity: 0.0824 1.6589 0.1191 0.8687 2.8834 1.1921 1.6195 3.8787 0.5065 6.0639 6.1409 23.5597 11.3503 0.9252 0.3282 10.6377 6.5881 1.9459 0.3692 1.1334 2.0622 29.7667 2.2158 4.2991 4.1746 36.5901 9.6710 2.5444 47.5126 5.2881 13.8915 86.5222 17.3151 1.3948 2.1576 71.6161 16.6006 0.4107 8.3420 375.1831 4.7088 9.9312 8.9516 7.1476 102.5408 2.0405 22.6535 11.5982 334.0399 1.8067 1.5700 7.4967 12.2135 3.1180 15.0040 12.3871 8.4628 4.2942 11.7767 15.1341 221.8678 90.7648 12.0358 16.0188 21.9299 10.1673 19.8792 5.7722 18.2234 13.3690 8.5085 6.5174 2.9558 28.0710 21.0229
temp: 298.150 k
press: 1.00000 atm
elementType: 8 8 8 6 6 6 6 6 6 6 6 6 6 6 6 1 1 1 1 1 1 1 1 1 1 1 1
symmnumber: 1
zpe: 549928.8 jmol-1
zpe.correction: 0.209457 hartree
zpe.thermalcorrener: 0.223770 hartree
zpe.thermalcorrenthalpy: 0.224715 hartree
zpe.thermalcorrgfe: 0.165493 hartree
zpe.sumelectzpe: -688.994832 hartree
zpe.sumelectthermal: -688.980518 hartree
zpe.sumelectthermalent: -688.979574 hartree
zpe.sumelectthermalfe: -689.038795 hartree
dipole: -3.1814 -2.8861 0.2843
dipole: 4.3049
quadrupole: -89.9120 -84.1951 -88.7724
quadrupole: -6.1692 1.9414 -0.3912
quadrupole: -2.2855 3.4314 -1.1459 -6.1692 1.9414 -0.3912
hfenergy: -689.2042883 hartree
pointgroup: C01 [X(C12H12O3)]
dipole: 1.2591332 1.1325869 0.0182508 debye
polarizability: 235.983887|25.0983841|148.5092006|-3.6101061|-7.6225461|71.2718482 unknown
InChI: InChI=1S/C12H12O3/c1-2-9-3-5-10(6-4-9)12(13)15-8-11-7-14-11/h2-6,11H,1,7-8H2
charge 0 multiplicity 1
27 atoms
O  -5.470468 0.725435 -0.221631
O  -1.78729 -0.049083 -0.147426
O  -1.256214 -2.287148 0.233046
C  -3.996646 0.791048 -0.550691
C  -4.569312 1.726375 0.467475
C  -3.22488 -0.43904 -0.134352
C  -0.879119 -1.102924 0.051588
C  0.533416 -0.63969 0.019448
C  1.558692 -1.603641 0.198784
C  0.884607 0.723498 -0.180194
C  3.275646 0.153067 -0.022101
C  2.907597 -1.208946 0.177355
C  2.234398 1.11088 -0.199952
C  4.710496 0.50489 -0.034718
C  5.254177 1.740224 -0.21853
H  -3.779489 1.174787 -1.555367
H  -4.394472 1.528554 1.532378
H  -4.751967 2.772572 0.195558
H  -3.378924 -1.281003 -0.832669
H  -3.509425 -0.772291 0.879587
H  1.274796 -2.649755 0.35262
H  0.0898 1.461982 -0.316618
H  3.694935 -1.959605 0.316046
H  2.485414 2.165601 -0.354176
H  5.396172 -0.340554 0.122955
H  6.339197 1.884813 -0.208747
H  4.646165 2.637252 -0.383569
