program: Gaussian 09
title: 000102941
version: EM64L-G09RevD.01
frameworkgroup: C1[X(C7H10O2S)]
method: RPBEPBE
basis: SDD
operation: Freq
keyword: #p
keyword: freq=noraman
keyword: PBEPBE/SDD
title: #p freq=noraman PBEPBE/SDD
converged: YES YES NO NO
title: Mulliken charges:
elementType: S O O C C C C C C C H H H H H H H H H H
charge: 0.084187 -0.266710 -0.250632 -0.367974 -0.626156 -0.213800 0.171799 0.341076 -0.752373 -0.628253 0.293577 0.269421 0.280565 0.241972 0.238299 0.245916 0.238866 0.214932 0.230277 0.255010
chargesum: 0.00000
title: Mulliken charges with hydrogens summed into heavy atoms:
elementType: S O O C C C C C C C
charge: 0.084187 -0.266710 -0.250632 -0.074397 -0.076170 0.266471 0.171799 0.341076 -0.052659 -0.142965
polarizability: 1.34337642e+02 -2.38725528e+00 9.53757534e+01 -1.17414824e+00 -3.51657257e+00 6.39625826e+01
1716.lowfreq: -15.9629 -9.6290 -5.3209 -0.0021 0.0015 0.0019 19.3938 46.0322 67.6705
frequency: 17.7196 46.0301 67.6632 92.2310 154.9732 171.8069 220.3048 251.6343 346.2715 367.8409 388.4807 393.2612 518.3784 546.9160 574.7354 599.6709 632.6116 784.8507 803.4021 877.6686 885.6413 929.0524 955.1999 965.8628 990.4799 1008.8888 1040.2952 1052.4902 1067.2281 1112.4603 1129.3094 1177.3453 1227.1147 1284.6464 1314.9788 1393.1494 1396.9977 1415.5237 1448.9061 1450.6258 1455.6922 1471.7798 1608.6180 1653.3382 2991.2661 2991.8167 3065.2295 3075.2057 3097.4574 3099.7118 3104.6085 3140.9002 3207.3475 3216.8485
redmass: 4.4271 5.5452 4.7367 3.6872 4.3192 1.1230 3.0006 4.0749 3.3636 2.8882 3.0747 3.5588 4.9124 4.8635 4.0760 8.1681 1.5325 2.0857 7.4081 1.5978 1.1043 2.1964 1.4798 2.8312 1.3162 1.3928 1.7089 1.5072 1.1880 5.0450 2.0053 1.5330 1.2372 2.5645 1.5616 1.7861 1.1872 1.2492 1.0965 1.1316 1.0449 1.0613 11.3903 5.1634 1.0362 1.0590 1.1036 1.0970 1.0547 1.1008 1.0619 1.0906 1.1170 1.1157
irintensity: 1.9421 3.2933 2.4002 3.3440 1.0799 1.6196 2.0895 5.0138 1.3259 15.1194 4.3904 0.3517 3.7351 4.1463 7.0594 7.8193 10.9203 9.1475 10.5168 5.0055 2.4808 9.6751 1.6986 49.1396 59.4603 17.8599 16.2993 6.5398 28.4800 446.6193 19.6870 3.5559 6.1091 101.6229 13.2719 4.7978 22.1362 10.9075 10.4884 7.2193 15.9969 40.5448 146.8355 4.0296 13.7229 17.3733 8.2158 15.6733 12.5608 25.3858 4.6539 4.7910 6.1409 5.3288
temp: 298.150 k
press: 1.00000 atm
elementType: 16 8 8 6 6 6 6 6 6 6 1 1 1 1 1 1 1 1 1 1
symmnumber: 1
zpe: 408419.8 jmol-1
zpe.correction: 0.155559 hartree
zpe.thermalcorrener: 0.166893 hartree
zpe.thermalcorrenthalpy: 0.167837 hartree
zpe.thermalcorrgfe: 0.116124 hartree
zpe.sumelectzpe: -820.437742 hartree
zpe.sumelectthermal: -820.426408 hartree
zpe.sumelectthermalent: -820.425464 hartree
zpe.sumelectthermalfe: -820.477178 hartree
dipole: -0.3072 0.0703 1.6212
dipole: 1.6515
quadrupole: -59.5570 -70.2267 -66.8626
quadrupole: 12.4672 -2.8709 -0.4532
quadrupole: 5.9918 -4.6780 -1.3138 12.4672 -2.8709 -0.4532
hfenergy: -820.5933014 hartree
pointgroup: C01 [X(C7H10O2S1)]
dipole: -0.1247945 0.1557267 0.6183428 debye
dipolederiv: -0.1306653 0.0898807 -0.0054626 0.1549928 -0.3132511 0.1562698 -0.0628898 0.1749815 -0.3069671 -1.7315773 0.247124 0.0677658 0.2442776 -0.5046546 -0.0178987 0.182309 -0.0494188 -0.2534559 -0.7047868 -0.0830414 0.0062714 0.0975578 -0.9581145 -0.0069662 0.0536948 -0.0057071 -0.3177616 -0.0307971 -0.0268248 -0.0513217 -0.2765714 0.24497 -0.1344167 0.1023292 -0.098999 0.1935382 -0.0776351 -0.0893007 0.0173612 0.0732759 0.1119775 -0.0024582 -0.0738988 -0.0879072 0.1291459 0.9518421 -0.013879 0.0425156 0.2953522 0.1570163 -0.0286362 -0.195268 0.0670822 0.2299619 1.9706804 -0.0966901 -0.0974387 -0.2608468 1.0820219 0.0170547 -0.1641704 0.0243603 0.2380912 -0.4430383 -0.175112 0.0209255 -0.146681 0.2643304 0.020425 0.0260847 0.0153566 -0.0536395 -0.0172818 0.0803252 0.0006667 0.0712004 -0.1464948 -0.0067318 0.0073227 -0.0019224 0.0650878 0.0053616 0.1518765 -0.0310708 -0.0621849 -0.0732417 -0.0026593 -0.0332531 -0.0125265 -0.3258176 0.0804647 0.0193579 -0.055273 0.0913799 0.0291823 -0.0192135 -0.0736837 -0.0240817 -0.0514698 0.124089 -0.0071491 0.032292 -0.0706647 -0.0843663 -0.0386025 0.0375699 -0.0215951 0.0573236 -0.00734 0.0082002 0.0874844 -0.0211628 0.0437621 0.0109717 0.1327541 0.0224306 0.0167923 -0.0461229 -0.0292117 -0.0130526 -0.0851088 0.0442809 -0.0428868 -0.0083402 -0.0806267 -0.03551 -0.084728 0.0594251 -0.0504087 -0.0567926 -0.0020237 0.0922812 0.0394294 0.0719183 0.0012633 0.0599275 0.0485913 -0.1098746 0.0518736 0.0579126 0.0142775 -0.1045816 0.0492747 -0.0071761 0.0933092 0.0396134 0.0964129 0.050117 0.0528051 -0.0215408 0.0887979 -0.0625996 -0.0517301 -0.1122278 -0.1500455 0.0185227 -0.0662957 0.0046877 0.0045783 0.0205076 0.0135791 0.1107575 -0.0260665 -0.0763114 0.0148662 -0.1085732 0.0245478 0.008932 0.0186969 0.0067265 0.1685562 0.1265923 0.0031715 0.0088184 0.0248548 -0.0353479 -0.0027796 0.0065894 -0.0003257 0.19301 unknown
polarizability: 133.792166|-5.2528267|93.5253628|0.2550255|-9.1416831|66.3584491 unknown
InChI: InChI=1S/C7H10O2S/c1-5(2)7(8)9-3-6-4-10-6/h6H,1,3-4H2,2H3
charge 0 multiplicity 1
20 atoms
S  -3.145351 1.23751 -0.794014
O  0.020766 0.154551 0.196642
O  1.2681 -1.808518 0.052727
C  -2.349638 0.223462 0.633691
C  -3.747312 -0.212673 0.300841
C  -1.200982 -0.685949 0.282977
C  1.227675 -0.552988 0.074368
C  2.39449 0.384467 -0.022315
C  2.139364 1.877019 0.000847
C  3.630946 -0.176223 -0.131456
H  -2.206576 0.822963 1.539283
H  -3.883671 -1.156135 -0.238519
H  -4.55079 0.048415 0.995035
H  -1.361735 -1.19507 -0.684324
H  -1.043895 -1.455996 1.06421
H  1.46796 2.176817 -0.823444
H  1.636796 2.179604 0.937016
H  3.086082 2.435716 -0.089838
H  4.531772 0.441745 -0.209481
H  3.7491 -1.265219 -0.145346
