program: Gaussian 09
title: 000103024
version: EM64L-G09RevD.01
frameworkgroup: C1[X(C22H34O3)]
method: RPBEPBE
basis: SDD
operation: Freq
keyword: #pfreq=noraman
keyword: PBEPBE/SDD
title: #p freq=noraman PBEPBE/SDD
converged: YES YES NO NO
title: Mulliken charges:
elementType: O O O C C C C C C C C C C C C C C C C C C C C C C H H H H H H H H H H H H H H H H H H H H H H H H H H H H H H H H H H
charge: -0.458275 -0.226845 -0.443975 0.362931 -0.099012 -0.192447 -0.078450 0.085249 -0.600624 -0.521923 0.263005 -0.084947 -0.539505 -0.498971 -0.822176 0.492856 -0.516496 -0.487937 0.156508 -0.829624 -0.742202 -0.671152 -0.452473 -0.049002 -0.770431 0.152074 0.248995 0.188090 0.231512 0.222227 0.214891 0.208332 0.225520 0.232406 0.215398 0.222515 0.207611 0.236659 0.222260 0.240402 0.206242 0.217183 0.208751 0.225298 0.226922 0.225558 0.221454 0.239193 0.208966 0.203816 0.228438 0.217897 0.223954 0.328454 0.197267 0.256476 0.252439 0.237817 0.330900
chargesum: 0.00000
title: Mulliken charges with hydrogens summed into heavy atoms:
elementType: O O O C C C C C C C C C C C C C C C C C C C C C C
charge: -0.129821 -0.226845 -0.113075 0.362931 0.053062 0.056548 0.109640 0.085249 -0.146885 -0.098699 0.263005 0.140572 -0.091702 -0.068845 -0.122855 0.492856 -0.093072 -0.279185 0.156508 -0.151846 -0.072589 -0.238898 -0.010621 0.148265 -0.023700
polarizability: 2.96027524e+02 -1.99384429e+00 2.24911390e+02 3.46235611e-01 -1.68329034e+00 1.88689131e+02
1716.lowfreq: -17.6984 -6.6330 -0.0006 -0.0003 0.0005 3.0929 30.5926 38.6184 49.1330
frequency: 30.3242 38.3855 49.1197 63.9033 86.0455 97.8574 119.9082 163.1201 174.1786 179.2322 187.8293 191.5761 219.4050 221.5546 229.9974 243.3400 245.7534 267.2427 276.1673 283.2611 285.8114 293.2619 299.6364 313.9759 318.7347 323.8587 329.0466 353.4069 358.0322 379.9091 399.0100 409.4467 431.7708 438.9382 450.7146 458.2354 466.4176 482.5333 498.2836 527.6210 564.2512 570.6237 578.2125 591.8133 600.2734 615.4445 664.0799 696.1049 723.9167 787.1132 798.5452 811.5417 824.0727 839.1103 845.6879 877.7066 887.9566 891.9070 905.9444 918.4259 926.3441 937.3209 943.3576 949.2765 960.9806 977.4067 987.1126 989.9225 1000.9785 1005.9258 1018.4228 1022.0003 1027.1828 1033.3051 1066.0824 1069.4480 1074.0840 1089.4474 1102.0609 1111.5229 1114.5270 1119.3041 1129.1596 1135.2501 1140.4846 1148.9071 1151.6623 1165.5335 1170.5955 1185.5696 1191.7860 1197.5303 1211.4356 1220.6768 1244.0387 1248.8714 1252.6898 1265.0969 1271.4878 1276.8330 1282.5955 1291.5265 1294.3149 1297.7104 1309.2655 1316.8063 1320.6752 1327.1344 1333.2124 1335.2057 1340.5065 1345.2501 1350.3008 1357.6153 1364.7878 1366.7592 1386.1643 1392.1655 1404.4849 1404.9057 1434.3013 1435.2804 1454.6284 1458.3432 1458.9793 1461.0277 1463.2616 1468.5973 1472.9071 1474.7724 1475.9497 1483.3764 1488.0563 1490.0031 1494.9989 1615.5394 1683.7046 2854.1979 2916.2226 2921.4203 2930.6975 2961.2673 2961.4067 2973.0731 2976.1239 2976.5853 2983.9828 2984.9106 2990.6024 2992.2264 2993.7739 2998.1526 2998.7221 3003.2111 3017.5692 3027.4906 3035.1846 3048.6057 3054.4625 3058.5196 3070.8466 3076.3732 3079.0524 3081.9545 3083.8634 3084.6497 3100.9321 3107.4537 3125.3600 3551.8192 3553.2461
redmass: 4.5787 3.4569 3.2364 3.2616 3.6583 5.4215 2.7533 3.2567 1.6689 3.0876 1.4606 1.5878 2.0167 1.4713 1.9101 1.7305 2.0988 2.9967 1.4782 2.3427 1.4895 2.0048 2.3869 1.2407 3.0467 2.8575 2.5920 2.8743 3.1401 3.1437 3.3253 3.6052 3.2228 3.3410 2.8706 2.2898 3.2940 3.9399 2.4619 2.9127 4.4567 3.3112 3.5521 2.8893 2.7719 3.6334 2.6602 3.2878 2.9023 2.2677 2.0546 1.6898 1.9034 2.4378 2.3185 2.1853 1.8484 1.6446 2.1482 2.0025 1.8525 1.8062 1.8701 2.2613 1.6685 2.1341 2.3050 2.1207 2.7137 2.2990 1.8657 2.0660 1.8943 1.9285 2.0214 2.6233 2.2066 1.9039 1.9143 2.3264 1.6846 1.8132 1.7625 1.9201 2.2363 1.8405 1.9253 1.9564 2.1289 1.8358 2.3227 1.6498 1.6249 1.8936 1.3997 1.3447 1.4756 1.4719 1.5034 1.3146 1.3151 1.3369 1.4948 1.5608 1.4100 1.3601 1.3899 1.4510 1.5168 1.3811 1.4501 1.6321 1.4555 1.5868 1.4429 1.2575 1.2283 1.2020 1.4131 1.3468 1.0886 1.0531 1.0670 1.0811 1.0883 1.0768 1.0567 1.0735 1.0698 1.0714 1.0772 1.0702 1.0728 1.0570 1.0610 7.7022 7.7762 1.0789 1.0809 1.0679 1.0838 1.0610 1.0615 1.0601 1.0802 1.0793 1.0440 1.0391 1.0573 1.0627 1.0353 1.0620 1.0630 1.0650 1.1012 1.1004 1.0956 1.1005 1.1021 1.1027 1.0981 1.0991 1.0944 1.0902 1.0981 1.0975 1.0991 1.0974 1.1032 1.0659 1.0653
irintensity: 0.4743 0.9724 1.8416 0.5281 0.7022 2.0389 0.5939 3.1964 1.7764 0.2897 0.3431 0.3288 1.1674 1.8267 3.8547 0.3351 0.6820 2.7355 41.2093 18.2317 73.3005 13.0818 7.5522 108.0602 7.6044 6.5823 32.7520 3.0607 6.2648 0.9511 1.3742 1.8060 3.5977 4.6714 0.5767 2.6334 4.5115 6.1048 0.9300 1.7938 5.2193 10.7207 1.0346 3.3186 3.0015 4.9087 4.1553 0.8477 4.7540 2.3926 1.6281 9.5220 7.3825 2.1541 12.1843 4.4531 3.0798 0.9351 2.9937 4.5342 6.4445 3.9934 33.5195 38.0970 9.1711 20.6794 22.5819 27.8571 27.1308 3.7512 16.4660 4.8591 22.2849 6.5760 6.6908 3.9480 7.8437 21.7436 0.1404 14.7346 38.9927 2.1539 3.4057 1.8621 19.6871 20.5154 4.7371 94.7405 10.4368 5.1709 2.7236 21.3018 6.5880 3.4965 8.0955 6.5846 26.3274 6.5937 3.3704 2.3784 2.3727 0.5447 14.4273 7.8554 2.0502 0.5571 4.2300 1.4165 1.5192 15.9085 6.1936 18.3510 1.2625 6.8379 5.1326 69.2468 16.1686 10.8716 15.0778 28.2692 22.6101 16.3903 6.4516 11.0182 6.4319 1.1806 6.4772 8.7664 14.7503 13.2319 3.3491 25.0323 2.2303 0.2705 12.3778 76.2999 3.0393 35.6638 12.1816 42.0277 37.5106 3.2446 72.6608 25.4710 23.6021 2.1267 35.7202 16.9414 24.6521 24.2012 3.0858 42.5062 7.2804 51.3821 39.6631 4.1039 61.0506 43.1172 40.3962 51.5578 26.2059 29.2418 6.3535 38.6037 79.1728 6.2683 32.4305 13.5543 18.5801 3.3371 1.4506
temp: 298.150 k
press: 1.00000 atm
elementType: 8 8 8 6 6 6 6 6 6 6 6 6 6 6 6 6 6 6 6 6 6 6 6 6 6 1 1 1 1 1 1 1 1 1 1 1 1 1 1 1 1 1 1 1 1 1 1 1 1 1 1 1 1 1 1 1 1 1 1
symmnumber: 1
zpe: 1351913.4 jmol-1
zpe.correction: 0.514917 hartree
zpe.thermalcorrener: 0.540133 hartree
zpe.thermalcorrenthalpy: 0.541077 hartree
zpe.thermalcorrgfe: 0.462772 hartree
zpe.sumelectzpe: -1082.434147 hartree
zpe.sumelectthermal: -1082.408931 hartree
zpe.sumelectthermalent: -1082.407987 hartree
zpe.sumelectthermalfe: -1082.486292 hartree
dipole: 1.4026 2.1850 -2.2149
dipole: 3.4128
quadrupole: -179.7264 -147.3846 -155.0454
quadrupole: 6.3164 4.5858 -1.7025
quadrupole: -19.0076 13.3342 5.6734 6.3164 4.5858 -1.7025
hfenergy: -1082.9490634 hartree
pointgroup: C01 [X(C22H34O3)]
dipole: 0.5322239 0.8651001 -0.8781731 debye
polarizability: 296.0749296|-0.8167592|224.8501151|-0.2586659|-1.822838|188.7029998 unknown
InChI: InChI=1S/C22H34O3/c1-13-11-19-17-6-5-15-12-16(24)7-9-20(15,3)18(17)8-10-21(19,4)22(13,25)14(2)23/h5,13,16-19,24-25H,6-12H2,1-4H3
charge 0 multiplicity 1
59 atoms
O  -3.309554 -0.582926 -1.866241
O  -4.895945 -0.882936 1.337119
O  6.893709 -0.129183 -0.296191
C  -1.933928 -0.462486 0.255303
C  -1.158497 0.79273 -0.259552
C  0.30028 0.888072 0.234174
C  1.068901 -0.415606 -0.152608
C  -3.35431 -0.20367 -0.428614
C  -2.1324 1.957496 0.015043
C  -1.185019 -1.728536 -0.225019
C  2.559293 -0.407519 0.368009
C  -3.547772 1.381323 -0.336056
C  0.293236 -1.704065 0.251708
C  0.999722 2.121716 -0.383834
C  -2.059402 -0.471608 1.801962
C  3.217576 0.956659 0.075643
C  3.359652 -1.516109 -0.402484
C  2.506618 2.063356 -0.272224
C  -4.498074 -1.057703 0.15201
C  2.631851 -0.681226 1.902877
C  -4.657382 1.93315 0.582983
C  4.735415 1.024206 0.209571
C  4.888771 -1.467591 -0.188948
C  5.446832 -0.096963 -0.583799
C  -5.118976 -2.12133 -0.734369
H  -1.069598 0.68623 -1.371126
H  0.308694 1.00305 1.337102
H  1.131501 -0.40862 -1.266362
H  -2.090553 2.251816 1.081218
H  -1.907605 2.859442 -0.581872
H  -1.222545 -1.78586 -1.330216
H  -1.676525 -2.644851 0.158572
H  -3.810197 1.678947 -1.37177
H  0.31477 -1.824554 1.350373
H  0.809088 -2.58901 -0.167005
H  0.627591 3.048148 0.098443
H  0.712285 2.209501 -1.45642
H  -2.531231 -1.406785 2.147566
H  -1.066688 -0.399524 2.278269
H  -2.679584 0.354027 2.184028
H  3.145737 -1.411326 -1.48678
H  2.987149 -2.512572 -0.099216
H  3.051489 2.995805 -0.485283
H  2.365068 -1.72739 2.137533
H  3.648514 -0.506835 2.294648
H  1.947621 -0.014803 2.458299
H  -5.66064 1.590293 0.273838
H  -4.517163 1.625707 1.632175
H  -4.647327 3.038971 0.536095
H  5.092648 2.018727 -0.125079
H  5.045933 0.911534 1.26921
H  5.151162 -1.659396 0.8690
H  5.3835 -2.253093 -0.789575
H  -2.583039 -0.067099 -2.299385
H  5.280583 0.070456 -1.672602
H  -5.563893 -1.656545 -1.632641
H  -4.343179 -2.810347 -1.114076
H  -5.883995 -2.670534 -0.163375
H  7.285735 0.752538 -0.522952
