program: Gaussian 09
title: 000102950
version: EM64L-G09RevD.01
frameworkgroup: C1[X(C6H12N2O4S)]
method: RPBEPBE
basis: SDD
operation: Freq
keyword: #p
keyword: freq=noraman
keyword: PBEPBE/SDD
title: #p freq=noraman PBEPBE/SDD
converged: YES YES NO NO
title: Mulliken charges:
elementType: S O O O O N N C C C C C C H H H H H H H H H H H H
charge: 0.134451 -0.432266 -0.431742 -0.228056 -0.228506 -0.621371 -0.620410 -0.695810 -0.696735 -0.099097 -0.100037 0.233535 0.235001 0.248204 0.323833 0.247833 0.323954 0.243991 0.243688 0.302072 0.278359 0.301212 0.278722 0.379778 0.379400
chargesum: 0.00000
title: Mulliken charges with hydrogens summed into heavy atoms:
elementType: S O O O O N N C C C C C C
charge: 0.134451 -0.052488 -0.052343 -0.228056 -0.228506 -0.040941 -0.040476 -0.123773 -0.124948 0.144894 0.143650 0.233535 0.235001
polarizability: 1.38306343e+02 1.22379517e+01 1.02814719e+02 2.36002729e-01 -1.06959919e-02 8.28205573e+01
1716.lowfreq: -9.3392 -0.0024 -0.0021 -0.0002 0.5907 10.5076 25.2212 31.8358 47.6338
frequency: 25.2123 31.1358 47.6140 53.4446 65.6708 107.6784 141.5834 184.1807 204.9169 238.9335 242.9258 261.9531 264.1933 283.2886 312.6672 368.8352 392.0615 465.6798 470.8630 536.5467 540.1640 570.5469 573.0230 625.6668 628.4312 680.7961 684.6036 729.4435 731.0233 754.7003 768.1280 897.1872 940.8213 995.4839 997.6916 1042.9569 1049.5676 1088.6740 1097.6135 1151.5409 1171.5183 1206.7940 1215.8549 1241.3500 1256.6354 1258.4729 1265.0331 1300.4431 1308.6545 1388.1437 1390.8450 1431.0574 1447.8057 1626.0074 1626.5749 1678.5300 1679.6470 2881.4175 2885.0179 3034.6437 3035.8417 3131.2817 3132.0704 3467.1457 3467.4747 3515.1466 3515.5887 3601.1874 3601.7354
redmass: 5.2261 8.3586 5.6523 11.8513 5.7389 5.3615 7.1103 3.6593 5.1692 1.2339 1.2678 3.4438 3.5855 2.5263 2.1828 3.7033 5.2846 3.9867 4.1988 3.7650 3.7073 1.3095 1.3124 1.3794 1.4270 3.6584 3.8257 3.9040 4.3379 2.6096 2.9022 2.0381 1.9686 3.2565 3.4094 2.3142 2.2904 2.3907 2.6172 1.1474 1.1241 1.4269 1.3792 1.1586 1.3618 1.6548 1.3921 1.3710 1.3530 1.9199 1.9187 1.0923 1.0895 1.0951 1.0949 9.2141 8.9542 1.0803 1.0804 1.0634 1.0630 1.1015 1.1014 1.0445 1.0445 1.0640 1.0640 1.0988 1.0989
irintensity: 0.6552 2.7466 6.9713 1.1800 1.6657 2.1344 0.0049 7.5493 2.5136 32.2049 27.9221 25.4568 12.9245 19.4332 14.9121 9.8043 11.2984 0.4384 92.7778 14.9433 4.7788 43.7241 55.6468 112.5404 485.3761 39.5565 52.8023 26.1979 0.7672 7.0025 0.0521 6.6021 9.7595 53.7085 4.7553 632.3792 20.1577 38.8642 0.1084 5.4367 0.1411 1.8004 0.2091 3.5367 1.2110 29.7992 4.6073 29.0252 0.8750 0.4094 15.6217 43.0387 5.8667 67.1041 34.7393 52.9222 367.9803 50.9455 49.7773 6.2430 33.7179 6.3979 0.0735 3.4736 3.2471 25.5118 21.4699 4.8629 4.6372
temp: 298.150 k
press: 1.00000 atm
elementType: 16 8 8 8 8 7 7 6 6 6 6 6 6 1 1 1 1 1 1 1 1 1 1 1 1
symmnumber: 1
zpe: 502487.6 jmol-1
zpe.correction: 0.191387 hartree
zpe.thermalcorrener: 0.207041 hartree
zpe.thermalcorrenthalpy: 0.207985 hartree
zpe.thermalcorrgfe: 0.146462 hartree
zpe.sumelectzpe: -1043.249486 hartree
zpe.sumelectthermal: -1043.233832 hartree
zpe.sumelectthermalent: -1043.232888 hartree
zpe.sumelectthermalfe: -1043.294411 hartree
dipole: -0.0269 0.0191 0.9902
dipole: 0.9908
quadrupole: -62.1082 -74.4072 -90.5871
quadrupole: -0.1974 -0.0186 0.0139
quadrupole: 13.5926 1.2937 -14.8863 -0.1974 -0.0186 0.0139
hfenergy: -1043.4408733 hartree
pointgroup: C01 [X(C6H12N2O4S1)]
dipole: 0.0123998 -0.3895975 -0.0010934 debye
dipolederiv: -0.4128988 -0.0015302 -0.028739 -0.0034134 -0.0363302 -0.0045545 -0.0707739 -0.0049374 -0.202167 -1.3236748 -0.0849286 0.2049554 -0.1218806 -0.360898 -0.0626186 0.3593823 -0.0534055 -0.3861181 -1.3204439 0.0754778 0.2084923 0.1179299 -0.3497067 0.065564 0.3615837 0.0580646 -0.3972284 -0.9348491 0.0068848 0.0152402 0.1858311 -0.4315133 0.2018021 -0.2275553 0.2182929 -0.5405121 -0.9320352 -0.0150322 0.0219185 -0.2061186 -0.4571558 -0.2045847 -0.21151 -0.2252638 -0.5191626 -0.6269998 -0.0423929 -0.1501572 -0.0381677 -0.689288 -0.1827859 -0.1160464 -0.1580351 -0.4426257 -0.6203784 0.0383631 -0.1552372 0.0347135 -0.6832881 0.1842739 -0.1196199 0.1582019 -0.4561893 0.1956509 0.1163366 0.0554366 0.2077291 0.0102279 0.0240062 0.1778185 0.0708892 0.1809652 0.1955533 -0.111685 0.0601895 -0.1954322 0.0029144 -0.0155914 0.1833616 -0.059804 0.1848242 0.3810488 0.1358686 0.1875447 -0.0545178 0.3263223 0.1637302 0.0709613 0.2198425 0.1932221 0.3759245 -0.1275143 0.1938858 0.0544365 0.3188513 -0.1556036 0.0714324 -0.2221206 0.2084128 1.7646415 -0.017762 -0.1308202 -0.0946165 0.4289434 -0.3331208 -0.1318291 -0.388362 0.7279942 1.7588448 0.0392218 -0.1481138 0.1191519 0.4602777 0.3344833 -0.1545794 0.3963652 0.7014395 0.0149874 -0.0309321 -0.0502451 -0.0482237 0.0558768 0.0479834 -0.0330822 0.0452222 -0.1279912 0.1140044 -0.0284005 -0.026024 -0.0026131 0.0021098 -0.0288474 -0.0451712 -0.0047233 0.0811773 0.015011 0.0284167 -0.0514356 0.0462779 0.0522769 -0.0558407 -0.0349441 -0.0533672 -0.1253273 0.1152576 0.0279614 -0.0276548 0.0006149 0.0040081 0.0323726 -0.0458754 0.0078823 0.0796097 0.0067684 0.0294276 -0.0022833 0.010139 -0.1617677 -0.1202232 -0.0041272 -0.0737279 -0.044971 0.0061177 -0.0303308 -0.0021659 -0.0094871 -0.1559513 0.123279 -0.004454 0.0782804 -0.049799 0.0297495 -0.0625195 -0.0014241 0.058575 0.3502394 0.0113336 0.0087656 -0.0346708 0.1825069 0.2491303 -0.066828 -0.027655 -0.0800118 0.2094168 0.1678736 -0.002261 0.0947741 0.0896861 0.0286141 0.0584697 -0.0038524 -0.0610086 0.3509644 -0.0147261 0.0094139 0.0314809 0.1793783 0.2474224 0.0660121 -0.0266025 0.0812355 0.204396 -0.172897 -0.0010554 -0.0970703 0.0972977 0.3361891 0.0467753 -0.0598127 0.0111308 0.2821353 0.1437527 -0.021258 0.1356176 0.1859242 0.3363644 -0.0493595 -0.0554399 -0.0122738 0.2669387 -0.1490609 -0.0185768 -0.1394258 0.1996534 unknown
polarizability: 137.2143631|0.6560352|82.8297493|13.6751391|0.3754046|103.8975069 unknown
InChI: InChI=1S/C6H12N2O4S/c7-3(5(9)10)1-13-2-4(8)6(11)12/h3-4,9,11H,1-2,7-8H2
charge 0 multiplicity 1
25 atoms
S  0.002856 -1.394804 0.036697
O  4.041621 0.770213 -0.899085
O  -4.041028 0.760116 0.893054
O  1.811137 1.275749 -1.274883
O  -1.818461 1.331307 1.219466
N  3.257121 0.542361 1.770247
N  -3.255912 0.460514 -1.778842
C  0.99347 -0.184626 1.107351
C  -0.992227 -0.239638 -1.088548
C  2.476798 -0.115112 0.697934
C  -2.475686 -0.158617 -0.683382
C  2.674853 0.709285 -0.577089
C  -2.676609 0.714304 0.558641
H  0.914809 -0.573298 2.137483
H  0.497737 0.795787 1.068301
H  -0.910655 -0.673681 -2.100265
H  -0.502161 0.74438 -1.093139
H  2.827034 -1.148583 0.456233
H  -2.825511 -1.182712 -0.405502
H  4.234566 0.721894 1.521986
H  3.145883 0.102771 2.688184
H  -4.238269 0.630802 -1.544031
H  -3.128632 0.001676 -2.685166
H  4.164734 1.329193 -1.713531
H  -4.168067 1.35352 1.682186
