program: Gaussian 09
title: 000102937
version: EM64L-G09RevD.01
frameworkgroup: C1[X(C11H10O2)]
method: RPBEPBE
basis: SDD
operation: Freq
keyword: #pfreq=noraman
keyword: PBEPBE/SDD
title: #p freq=noraman PBEPBE/SDD
converged: NO NO NO NO
title: Mulliken charges:
elementType: O O C C C C C C C C C C C H H H H H H H H H H
charge: -0.423686 -0.433764 -0.392973 -0.386723 -0.481065 0.238009 0.291892 -0.202629 -0.203235 0.015201 0.039534 -0.338012 -0.366391 0.232892 0.274287 0.241913 0.239884 0.242655 0.244618 0.245440 0.214667 0.352839 0.354648
chargesum: 0.00000
title: Mulliken charges with hydrogens summed into heavy atoms:
elementType: O O C C C C C C C C C C C
charge: -0.070847 -0.079116 -0.160081 -0.112436 0.000732 0.238009 0.291892 0.040026 0.041383 0.015201 0.039534 -0.092573 -0.151724
polarizability: 1.38397518e+02 3.21417495e+00 1.34231040e+02 1.33525239e+00 2.51530217e-01 7.27632187e+01
1716.lowfreq: -5.5741 -1.2959 -0.0008 -0.0008 -0.0007 12.4083 123.5390 134.7738 138.8360
frequency: 123.5368 134.7454 138.8348 217.6325 276.1068 304.3336 315.2082 369.0887 400.7247 428.5190 450.8166 483.7463 531.0484 558.4143 591.2664 595.5684 613.3854 717.4306 729.0362 732.4270 785.9839 793.3373 811.6837 870.8456 876.7417 903.5529 909.4629 932.6599 938.0865 959.5541 978.5214 1019.6661 1078.2480 1098.9471 1114.4540 1133.2503 1145.2192 1158.8942 1196.5924 1200.3881 1219.9803 1241.2089 1247.4010 1265.2285 1297.5044 1302.3080 1410.4988 1423.0946 1468.3594 1488.0260 1575.3967 1612.3468 1645.8832 3017.6226 3064.1137 3098.9646 3114.8620 3121.6128 3166.3903 3169.0490 3199.4215 3582.4615 3585.7995
redmass: 3.8607 4.1523 6.3198 4.8830 5.0149 1.1071 1.1323 5.3447 3.2697 3.8387 5.6479 2.6644 3.8054 4.7158 2.9507 3.6911 3.4743 6.8455 5.2166 2.1059 1.5293 5.7832 3.6755 2.2892 2.3825 1.6301 1.3309 3.4799 3.6522 1.7865 2.8204 1.4682 1.2150 1.4685 1.3358 1.5621 2.0526 1.2900 1.4944 1.8281 1.6578 2.1357 1.4715 1.6461 1.6082 1.9197 5.3285 4.0941 1.1141 3.3138 5.8452 8.3931 7.6265 1.0587 1.0896 1.1080 1.0894 1.0912 1.0875 1.0942 1.1103 1.0659 1.0661
irintensity: 1.5920 0.2201 0.0827 0.4437 16.7496 92.7954 175.4252 1.5629 14.0844 0.1102 2.7548 5.0488 2.8914 1.8699 14.7287 1.6155 7.2668 21.0556 9.2627 57.0496 46.8835 18.2859 22.0955 1.8187 4.5100 13.7838 0.5732 10.5310 11.6490 5.4301 26.6255 8.5120 13.4390 3.4307 61.8918 19.8466 238.2537 15.6109 18.4871 4.6960 6.3173 62.0036 13.9726 1.7732 20.7772 8.1799 6.9224 108.0149 10.9304 98.6235 5.5145 12.4885 7.6822 41.9318 43.5571 38.4034 18.4892 15.1238 4.0558 8.1271 18.1957 29.0616 24.3045
temp: 298.150 k
press: 1.00000 atm
elementType: 8 8 6 6 6 6 6 6 6 6 6 6 6 1 1 1 1 1 1 1 1 1 1
symmnumber: 1
zpe: 472139.1 jmol-1
zpe.correction: 0.179828 hartree
zpe.thermalcorrener: 0.190050 hartree
zpe.thermalcorrenthalpy: 0.190994 hartree
zpe.thermalcorrgfe: 0.144779 hartree
zpe.sumelectzpe: -574.640589 hartree
zpe.sumelectthermal: -574.630367 hartree
zpe.sumelectthermalent: -574.629423 hartree
zpe.sumelectthermalfe: -574.675638 hartree
dipole: 0.5362 -0.2868 0.0533
dipole: 0.6104
quadrupole: -68.1933 -71.4987 -76.7119
quadrupole: 11.2484 0.7600 1.2521
quadrupole: 3.9413 0.6360 -4.5773 11.2484 0.7600 1.2521
hfenergy: -574.8204171 hartree
pointgroup: C01 [X(C11H10O2)]
dipole: 0.2129907 0.1077316 -0.0266201 debye
dipolederiv: -0.0771804 0.0149255 -0.0395564 -0.120698 -1.3862267 -0.0046939 -0.0379535 -0.0074684 -0.399138 -0.0681385 0.0362864 -0.0473543 0.2325746 -1.4030997 -0.0106397 -0.0504488 -0.0062001 -0.3994008 0.0215938 -0.0619278 -0.0397451 -0.0786225 0.1791789 0.0833761 -0.0410191 0.0954143 -0.0010047 0.0224509 0.0352849 -0.0441793 0.0698411 0.1683411 -0.0554128 -0.053147 -0.0613556 0.0077084 0.1275624 0.0052905 0.0245856 0.0047024 -0.0946538 -0.0112919 0.0143848 -0.0163063 0.1564674 0.1267393 -0.1868296 -0.0360682 -0.0537903 -0.2513428 -0.0496626 0.004236 -0.031309 -0.1153962 0.167394 0.2044442 -0.0295312 0.0509286 -0.2258672 0.0443138 0.0009089 0.0213284 -0.0874982 -0.2357565 0.088768 0.1604756 0.165203 -0.0482834 0.0545228 0.1958566 -0.0575405 0.0230831 -0.2072397 -0.0896116 0.154323 -0.1687523 -0.0238981 -0.0504666 0.1898831 0.0633737 0.027374 -0.1315952 -0.0440573 0.0147333 0.1578208 1.2844264 0.0111572 -0.0059089 0.0052167 0.0301027 -0.1184339 -0.1218837 0.0143388 -0.2987322 1.2934616 0.0095383 -0.0035808 0.0233606 0.0210376 0.0760698 0.1822306 -0.0387608 -0.2363923 -0.1421533 0.0242861 -0.0229022 -0.0199688 -0.1482549 0.0662959 -0.1742001 -0.0408846 0.2392945 -0.1502573 -0.0250683 -0.0291128 0.0183905 -0.1807252 0.0331282 0.0056866 0.0012554 0.0424152 -0.1727436 -0.0638194 0.0107054 -0.0586652 0.0488663 0.050687 -0.0122298 0.0028248 -0.0454775 -0.0897585 0.0471934 0.0139433 0.0450455 0.0592477 -0.1982254 -0.001576 0.0946412 0.0019032 0.0721081 0.001082 0.0363523 0.0022189 0.063873 0.0444409 -0.0018927 -0.1295401 -0.0014726 0.0871741 -0.0028691 -0.0848264 -0.0009095 -0.135086 0.1443387 0.011738 -0.0847124 0.0363709 0.0335417 0.0781667 -0.1413431 0.0776485 -0.0070905 0.1434735 -0.009928 -0.0803146 -0.0316023 0.0423574 -0.0772173 -0.1375037 -0.078184 -0.0058965 -0.0355226 -0.0784674 0.0274997 -0.0733608 0.0518238 0.0113653 0.0280168 0.0103746 0.1638994 -0.0704156 0.0990039 0.0319277 0.1147981 -0.0026033 -0.0162744 0.0330216 -0.012997 0.1635538 0.0642295 0.0609715 0.0383708 0.0386831 0.3928711 0.0001145 0.0331017 -0.0061571 0.3468601 0.0541039 0.0379738 0.0456711 -0.0456346 0.3856036 0.0022997 0.0473357 -0.0053103 0.3674173 unknown
polarizability: 138.1177315|-3.2974818|134.3879958|-3.1206358|0.4714075|72.88605 unknown
InChI: InChI=1S/C11H10O2/c12-8-3-4-9(13)11-7-2-1-6(5-7)10(8)11/h1-4,6-7,12-13H,5H2
charge 0 multiplicity 1
23 atoms
O  -1.232474 -2.85036 0.029337
O  -1.114828 2.830467 0.012263
C  1.507298 -1.134036 -0.352792
C  1.48538 1.155505 -0.350815
C  1.962326 0.016491 -1.330384
C  0.026214 -0.711671 -0.176998
C  0.019791 0.706392 -0.174136
C  2.249009 -0.666543 0.929419
C  2.232976 0.696302 0.929539
C  -1.159443 -1.440089 0.010887
C  -1.171067 1.41898 0.011316
C  -2.373006 -0.724709 0.186424
C  -2.379332 0.685177 0.186357
H  1.701195 -2.170196 -0.673751
H  1.630079 2.19987 -0.654709
H  3.053592 0.025017 -1.492888
H  1.418059 0.012071 -2.29121
H  2.626228 -1.334744 1.707289
H  2.594087 1.371579 1.708674
H  -3.300925 -1.287225 0.325743
H  -3.330437 1.215856 0.327505
H  -0.330878 -3.240786 -0.085698
H  -2.017045 3.21345 0.144328
