program: Gaussian 09
title: 000102951
version: EM64L-G09RevD.01
frameworkgroup: C1[X(C10H5BrCl6)]
method: RPBEPBE
basis: SDD
operation: Freq
keyword: #p
keyword: freq=noraman
keyword: PBEPBE/SDD
title: #p freq=noraman PBEPBE/SDD
converged: YES YES NO NO
title: Mulliken charges:
elementType: Br Cl Cl Cl Cl Cl Cl C C C C C C C C C C H H H H H
charge: -0.012366 0.083095 0.073283 0.132562 0.110317 0.067598 0.067389 -0.135589 -0.169971 -0.176848 -0.167755 -0.502665 -0.586119 -0.009198 0.008877 -0.238830 -0.113604 0.375934 0.332766 0.325243 0.270839 0.265042
chargesum: 0.00000
title: Mulliken charges with hydrogens summed into heavy atoms:
elementType: Br Cl Cl Cl Cl Cl Cl C C C C C C C C C C
charge: -0.012366 0.083095 0.073283 0.132562 0.110317 0.067598 0.067389 0.240345 0.162795 -0.176848 -0.167755 -0.502665 -0.260876 -0.009198 0.008877 0.032009 0.151438
polarizability: 2.00337916e+02 1.53877637e+01 1.59341706e+02 -1.47531254e+01 -1.99328109e+00 1.56721325e+02
1716.lowfreq: -6.8252 -1.2169 -0.0033 -0.0031 -0.0027 7.2752 42.7858 65.4000 79.2549
frequency: 42.7663 65.3936 79.2548 87.0942 115.0026 123.0150 133.1889 144.9958 151.4545 154.3650 173.4314 187.9478 234.3494 246.6114 285.4261 312.8523 317.2914 336.2202 347.1020 370.9317 411.8736 497.9321 509.2201 590.0909 597.6825 651.3554 701.2509 703.7664 741.0125 764.0369 805.7501 817.2677 850.0521 867.6957 888.8431 950.9542 957.7505 975.9285 1003.4772 1031.3640 1041.7343 1069.3012 1080.8448 1096.8715 1110.5658 1138.6633 1153.4967 1207.5653 1244.2913 1264.2215 1278.7163 1296.2530 1337.2071 1605.3351 1608.1582 3051.9536 3092.8939 3093.2739 3167.6579 3197.7673
redmass: 14.6896 23.5355 17.7096 29.5744 11.8384 22.6214 24.3363 25.6973 24.4617 34.4072 15.5148 13.7309 7.2271 11.7486 6.7955 5.3784 20.0550 12.3747 27.9552 15.9959 4.7936 7.8107 7.4124 9.4713 6.9919 9.7376 6.7002 6.5724 6.0991 2.2870 2.7958 6.4477 7.6120 6.2144 4.1553 2.9550 1.5319 3.7912 5.4763 3.9839 7.2745 3.0616 2.3897 2.3162 1.1435 4.0356 1.3064 1.8269 1.4912 1.3902 1.4882 1.6713 1.7852 11.6177 6.6713 1.0853 1.0884 1.0862 1.0877 1.1068
irintensity: 0.6860 0.3937 0.1239 0.1048 0.0701 0.1114 0.0650 0.5143 0.2817 0.0414 0.3600 1.1404 1.9275 4.2553 4.6201 7.7729 0.5125 0.7472 0.3037 2.7615 8.2013 35.7989 1.3528 8.0166 39.6135 21.7210 35.7045 20.1328 118.6364 24.9614 24.1703 22.3957 15.2665 26.0525 6.4486 12.1537 1.3662 6.8907 12.9548 38.1883 55.4833 4.2881 0.6769 24.0006 8.2027 22.2948 24.3994 10.9360 40.0265 2.0128 13.5502 5.7112 12.9287 51.4381 5.8248 1.6025 0.9167 0.1379 0.3189 5.9082
temp: 298.150 k
press: 1.00000 atm
elementType: 35 17 17 17 17 17 17 6 6 6 6 6 6 6 6 6 6 1 1 1 1 1
symmnumber: 1
zpe: 319180.2 jmol-1
zpe.correction: 0.121569 hartree
zpe.thermalcorrener: 0.138496 hartree
zpe.thermalcorrenthalpy: 0.139440 hartree
zpe.thermalcorrgfe: 0.075004 hartree
zpe.sumelectzpe: -3156.587852 hartree
zpe.sumelectthermal: -3156.570925 hartree
zpe.sumelectthermalent: -3156.569981 hartree
zpe.sumelectthermalfe: -3156.634417 hartree
dipole: -0.2083 2.1884 -1.1392
dipole: 2.4760
quadrupole: -160.5661 -146.4071 -146.6915
quadrupole: -0.8288 0.1761 -0.3424
quadrupole: -9.3445 4.8145 4.5301 -0.8288 0.1761 -0.3424
hfenergy: -3156.7094213 hartree
pointgroup: C01 [X(C10H5Br1Cl6)]
dipole: 0.2820996 0.9323597 -0.0056493 debye
dipolederiv: -0.7247153 0.2485227 -0.0382223 0.2962947 -0.3108368 0.0048803 -0.1864203 0.1075755 -0.1465833 -0.1127219 0.0450964 0.0093342 0.033317 -0.5154808 -0.1541655 -0.0021485 -0.1487381 -0.137264 -0.3230284 0.179422 0.1620145 0.177476 -0.2492101 -0.1571894 0.1724602 -0.1736206 -0.2564253 -0.5999951 -0.1488469 -0.1547072 -0.1587111 -0.1192818 0.0066565 -0.2027594 -0.0175136 -0.1850171 -0.1811642 -0.0104661 -0.0690764 -0.0163571 -0.2185579 0.2658067 -0.0745419 0.2561327 -0.5750775 -0.0191105 0.0496478 0.1405989 0.0348468 -0.0208782 0.0020831 0.1312759 -0.0925517 -0.6250437 -0.0230394 0.1428144 -0.0438203 0.2048157 -0.5393093 0.1929128 -0.1010486 0.2673566 -0.1316694 -0.0958944 0.0644863 0.0359862 0.0050303 -0.2204334 -0.0022814 -0.0334896 0.0295027 -0.0317186 -0.040841 0.0168448 0.0543664 0.0611152 -0.085865 -0.1088801 0.1324416 -0.0784456 -0.0390448 0.0835115 0.0074406 0.0201672 -0.0898325 0.7852225 0.2258101 0.0457755 0.2567279 0.0416593 0.4145779 -0.3268695 -0.3521903 -0.2671905 0.2300707 0.3219815 -0.2199575 0.31305 0.315027 0.7972455 0.2474823 0.2913572 0.2644727 0.3055736 -0.406253 0.2900363 -0.3643742 0.866759 0.9477777 -0.3682306 0.174998 -0.5105887 0.3681438 -0.0301719 0.2073239 -0.1290483 0.1354525 -0.0824904 -0.0802626 -0.2156303 -0.0334703 -0.2405799 0.1079864 -0.1926301 0.084692 0.7817677 -0.0866325 -0.1864944 0.1997907 -0.2462158 0.7028114 -0.3100455 0.1508317 -0.3380461 -0.041673 0.0138215 0.0064814 -0.062666 0.2103903 0.0410988 0.0714371 -0.2243579 0.0360287 -0.1028749 -0.2174193 0.1122865 -0.1631858 0.0966394 -0.0593405 -0.042657 -0.0191254 -0.0620032 -0.1140643 0.058716 0.0334619 -0.0133591 0.0001232 0.0469531 0.0124356 -0.0222191 0.0560183 0.0495181 0.0499065 0.0004336 -0.0115962 -0.0389111 0.0722706 0.0297852 0.0155182 -0.0032864 -0.0376851 -0.0376649 0.0362292 -0.0591269 0.0730375 0.0304031 -0.0092496 -0.0364866 -0.0003684 -0.0195632 0.1193415 -0.0022971 0.0355758 -0.0343131 -0.0289419 -0.0386245 0.0792644 -0.038457 0.1319137 0.0598189 -0.0671827 0.0593919 -0.0619687 0.0261681 0.0177424 0.0902573 0.0393689 0.1216067 unknown
polarizability: 190.3924253|-26.874769|170.4907528|-5.250324|0.9134674|155.5177695 unknown
InChI: InChI=1S/C10H5BrCl6/c11-4-2-1-3-5(4)9(15)7(13)6(12)8(3,14)10(9,16)17/h1-5H
charge 0 multiplicity 1
22 atoms
Br 4.078986 -0.911545 0.444116
Cl 0.085272 -2.837583 -0.94928
Cl -2.153013 1.685227 1.754143
Cl -2.976162 -1.293087 -0.02432
Cl -1.130956 -1.734098 2.28509
Cl -0.058134 -0.231134 -3.128839
Cl -1.449473 2.569711 -1.455814
C  1.098057 -0.599157 0.52267
C  0.487867 0.667711 1.25554
C  -0.11278 -1.117936 -0.339259
C  -1.010728 0.680551 0.727767
C  -1.311928 -0.86111 0.651718
C  2.318246 -0.078676 -0.277084
C  -0.446779 -0.066361 -1.40651
C  -0.987069 1.006058 -0.768396
C  1.358081 1.815409 0.796668
C  2.347691 1.404619 -0.044077
H  1.377929 -1.385947 1.237447
H  0.457977 0.555202 2.352538
H  2.35516 -0.397295 -1.329387
H  1.186899 2.846242 1.117715
H  3.105858 2.044898 -0.501947
