program: Gaussian 09
title: 000102934
version: EM64L-G09RevD.01
frameworkgroup: C1[X(C9H18O2)]
method: RPBEPBE
basis: SDD
operation: Freq
keyword: #pfreq=noraman
keyword: PBEPBE/SDD
title: #p freq=noraman PBEPBE/SDD
converged: YES YES NO NO
title: Mulliken charges:
elementType: O O C C C C C C C C C H H H H H H H H H H H H H H H H H H
charge: -0.265434 -0.238823 0.020153 -0.464989 0.039072 -0.009223 -0.387312 -0.336922 -0.717313 -0.734447 -0.705565 0.196456 0.226120 0.215159 0.181765 0.194342 0.196551 0.226054 0.232067 0.180115 0.231056 0.202867 0.228722 0.217402 0.211474 0.212088 0.248307 0.194785 0.205475
chargesum: 0.00000
title: Mulliken charges with hydrogens summed into heavy atoms:
elementType: O O C C C C C C C C C
charge: -0.265434 -0.238823 0.216608 -0.023711 0.220837 0.185119 0.035293 0.075259 -0.054668 -0.093483 -0.056997
polarizability: 1.17624827e+02 -1.48563449e-01 1.02260966e+02 1.08462943e+00 -6.42527709e-01 8.85570665e+01
1716.lowfreq: -18.2000 -12.0965 0.0004 0.0006 0.0008 8.5773 25.4235 82.5184 113.8954
frequency: 24.1260 82.4519 113.8793 153.7282 167.9104 201.6318 218.9026 235.3632 261.7880 290.9906 317.1414 349.0493 376.6335 414.9817 420.8521 465.1787 509.6679 548.9547 619.6301 762.0943 784.8327 827.6899 853.2877 879.3957 902.2440 912.5247 937.8534 955.5285 967.3380 974.6126 982.5295 1027.7107 1062.0992 1081.7697 1125.6962 1132.6279 1155.1620 1168.6080 1199.9291 1207.6954 1224.0489 1248.9429 1294.8986 1297.5839 1304.8374 1327.4713 1334.1174 1350.8906 1355.5385 1366.1795 1375.5890 1386.6474 1393.1283 1395.5516 1434.9369 1449.7863 1459.3844 1465.8134 1466.5327 1474.3080 1479.3860 1486.4892 1491.8579 2886.6495 2909.3645 2931.1482 2956.3297 2967.3718 2976.6599 2989.4555 2993.4252 2999.6219 3056.6349 3062.2184 3063.3691 3064.8461 3067.3564 3083.9838 3089.0120 3096.9381 3097.3295
redmass: 2.9008 2.6450 3.3526 2.9400 2.5188 1.1447 1.1018 2.8319 1.0608 2.2307 2.6573 1.9362 2.2408 3.5012 4.4939 2.1718 3.6328 2.4389 3.0879 2.4526 3.2307 2.3404 2.9753 3.2734 2.9341 1.2637 1.6661 1.4512 1.5742 1.7578 1.7823 3.1733 2.0200 2.7989 1.8633 1.9473 1.9520 2.1657 1.9160 1.3729 1.2246 1.2367 1.4457 1.1589 1.3256 1.4073 1.3400 1.2678 1.4243 1.3149 1.2152 1.2818 1.2197 1.5928 1.0966 1.0849 1.0470 1.0467 1.0932 1.0516 1.0503 1.0480 1.0556 1.0828 1.0827 1.0695 1.0814 1.0353 1.0375 1.0398 1.0565 1.0617 1.1010 1.1000 1.1005 1.0992 1.0989 1.0956 1.0992 1.1001 1.0984
irintensity: 0.1331 1.7684 0.9681 1.5440 2.8205 0.3943 0.8696 2.8218 0.0510 2.7898 1.0315 0.9660 1.4310 0.6482 4.0930 4.1213 1.4468 4.1824 8.7244 8.2153 0.8988 14.1260 9.6547 48.1267 77.7943 13.0803 19.8776 3.2268 3.3020 6.4127 17.0689 14.6486 20.9311 120.7197 14.5507 24.1124 18.0313 4.6730 9.1799 5.9600 5.7579 2.9298 7.2890 29.8443 6.1125 3.6888 10.8377 6.1333 16.2494 3.4026 20.0598 19.5436 16.3846 10.4927 8.5088 5.6277 10.8758 3.5765 11.7287 0.9936 9.6950 13.7039 15.0399 49.2333 49.2993 96.0672 30.8867 41.2094 42.5548 12.1228 45.9061 25.4227 1.2726 52.9781 28.5457 41.3328 74.1519 35.2026 35.1835 32.2955 30.2088
temp: 298.150 k
press: 1.00000 atm
elementType: 8 8 6 6 6 6 6 6 6 6 6 1 1 1 1 1 1 1 1 1 1 1 1 1 1 1 1 1 1
symmnumber: 1
zpe: 674871.6 jmol-1
zpe.correction: 0.257045 hartree
zpe.thermalcorrener: 0.269561 hartree
zpe.thermalcorrenthalpy: 0.270505 hartree
zpe.thermalcorrgfe: 0.218460 hartree
zpe.sumelectzpe: -503.272056 hartree
zpe.sumelectthermal: -503.259540 hartree
zpe.sumelectthermalent: -503.258596 hartree
zpe.sumelectthermalfe: -503.310641 hartree
dipole: 1.5724 0.3936 1.7623
dipole: 2.3944
quadrupole: -61.4640 -72.0579 -69.4497
quadrupole: 1.5421 1.9579 -1.0694
quadrupole: 6.1932 -4.4007 -1.7925 1.5421 1.9579 -1.0694
hfenergy: -503.529101 hartree
pointgroup: C01 [X(C9H18O2)]
dipole: -0.6053408 0.1462162 -0.7068308 debye
polarizability: 117.556827|0.3440096|102.2682239|1.7112943|0.6613788|88.6178084 unknown
InChI: InChI=1S/C9H18O2/c1-7(2)6-9-10-5-4-8(3)11-9/h7-9H,4-6H2,1-3H3
charge 0 multiplicity 1
29 atoms
O  -0.371031 0.651757 0.212916
O  -0.827197 -1.718349 0.399712
C  0.115109 -0.698285 -0.080761
C  1.437943 -0.951354 0.637569
C  -1.671822 0.914809 -0.463531
C  2.649183 -0.067639 0.218651
C  -2.700305 -0.142243 -0.003562
C  -2.139532 -1.55619 -0.256243
C  -2.058403 2.352056 -0.118766
C  2.839305 -0.006648 -1.317193
C  2.594831 1.354679 0.827465
H  0.193793 -0.804948 -1.191031
H  1.252282 -0.844399 1.722725
H  1.681392 -2.015685 0.453709
H  -1.511725 0.808644 -1.563211
H  3.543566 -0.573511 0.641225
H  -3.655615 -0.008536 -0.548515
H  -2.892972 -0.008176 1.07685
H  -2.781903 -2.341782 0.172671
H  -2.030016 -1.735802 -1.350376
H  -1.277644 3.054985 -0.456997
H  -3.01306 2.624111 -0.604768
H  -2.173444 2.464114 0.973696
H  2.035886 0.586006 -1.793526
H  2.839502 -1.016516 -1.770564
H  3.800783 0.477755 -1.56979
H  1.697785 1.892841 0.478294
H  3.494534 1.934075 0.545053
H  2.549475 1.310129 1.931798
