program: Gaussian 09
title: 000102979
version: EM64L-G09RevD.01
frameworkgroup: C1[X(C21H19N3O)]
method: RPBEPBE
basis: SDD
operation: Freq
keyword: #p
keyword: freq=noraman
keyword: PBEPBE/SDD
title: #p freq=noraman PBEPBE/SDD
converged: YES YES NO NO
title: Mulliken charges:
elementType: O N N N C C C C C C C C C C C C C C C C C C C C C H H H H H H H H H H H H H H H H H H H
charge: -0.264322 -0.407746 -0.532322 -0.456810 -0.567234 0.390817 -0.303132 0.090918 0.227607 -0.449645 0.169802 -0.382187 -0.354454 0.534163 -0.265623 -0.215311 0.425953 -0.676064 0.386569 -0.373957 -0.429237 -0.421479 -0.412031 -0.243384 -0.246862 0.234906 0.240908 0.232476 0.271755 0.303583 0.255455 0.225631 0.270528 0.287962 0.307302 0.222836 0.220980 0.226952 0.308975 0.236652 0.235103 0.240625 0.226167 0.227175
chargesum: 0.00000
title: Mulliken charges with hydrogens summed into heavy atoms:
elementType: O N N N C C C C C C C C C C C C C C C C C C C C C
charge: -0.264322 -0.104163 0.026169 -0.149508 -0.091420 0.390817 -0.070657 0.090918 0.227607 -0.177889 0.169802 -0.126732 -0.128823 0.534163 -0.042788 0.005670 0.425953 -0.449112 0.386569 -0.064983 -0.192584 -0.186376 -0.171406 -0.017217 -0.019687
chargesum: -0.00026
polarizability: 3.24496419e+02 6.84165140e+01 2.25090652e+02 2.91122344e+01 -2.70686360e+01 2.18339197e+02
1716.lowfreq: -7.8568 -1.4306 -0.1512 -0.1075 2.5904 5.3741 13.9818 17.8988 28.0948
frequency: 13.1916 17.7933 27.9918 58.9699 66.8143 78.4767 99.6897 122.3493 165.8414 185.9374 200.1535 214.6101 219.5314 231.0868 253.1990 272.2061 318.1639 325.3538 360.7497 386.0194 407.3109 409.7778 425.8876 456.0887 476.5615 506.7514 513.2381 524.9358 535.6825 541.9320 574.7627 586.3866 622.3744 630.5033 647.7989 667.5140 671.8458 707.8750 729.6057 742.2823 749.9351 751.8970 758.5928 759.2478 763.9484 771.1757 782.2978 803.8654 838.8973 854.1146 862.8602 867.3245 871.7422 904.1142 905.4354 937.5257 942.6425 948.7810 960.5909 977.2629 987.4721 993.3494 1001.1115 1013.3647 1022.4393 1061.0527 1093.4982 1106.9758 1120.6339 1131.7512 1141.6419 1153.9242 1158.5976 1170.8386 1172.9171 1199.6827 1208.7187 1240.3374 1242.4647 1253.4471 1277.2500 1286.8022 1296.0717 1300.8449 1320.2065 1342.3888 1350.7288 1364.5194 1389.6674 1404.1780 1419.7667 1420.6906 1435.9462 1457.4425 1464.1532 1469.8014 1482.9186 1497.1033 1534.9814 1557.6709 1585.1047 1586.1858 1607.4980 1612.1595 1631.2028 1642.7919 1649.3664 2986.3942 2998.1965 3058.5474 3106.3646 3117.9455 3123.5107 3123.9543 3129.9288 3133.9617 3141.2272 3146.8796 3161.1161 3163.5703 3192.6696 3216.6072 3411.3001 3515.4180 3530.8845 3611.9385
redmass: 6.0055 4.9381 4.3626 5.5819 7.0161 4.4012 5.0446 5.6832 4.7073 3.7886 3.8186 2.4569 2.7023 3.8896 2.4808 3.1543 3.3261 3.9503 4.2454 4.4306 4.1727 3.4971 2.9478 3.3219 2.4448 1.2941 6.7041 5.4710 3.1804 5.8160 3.0092 4.4390 6.4984 3.5344 1.7696 2.6072 1.8005 3.2895 4.6794 3.0045 1.9329 2.5521 1.4186 3.3778 2.6670 3.4332 2.3735 1.6428 1.2619 1.4554 5.2244 5.0444 1.5749 1.9337 4.6309 1.3815 2.7109 2.5609 1.3918 1.3026 1.3306 2.8950 1.3374 2.1695 2.2511 3.1865 1.6745 2.0616 1.8120 1.5006 1.5753 1.8965 1.2311 1.1189 1.0983 1.4059 1.5293 2.5282 1.6679 1.4804 1.8077 1.7680 2.0372 1.7549 1.5640 1.8323 1.7989 1.4127 5.1794 3.4357 3.7355 2.4674 4.8179 3.7159 2.2790 1.1136 3.0534 2.7694 2.9329 6.0570 6.2165 6.7851 5.7539 4.1794 6.8542 6.6255 1.0873 1.0683 1.0789 1.1002 1.0912 1.0858 1.0890 1.0855 1.0905 1.0888 1.0947 1.0952 1.1003 1.1001 1.0949 1.0982 1.0453 1.0759 1.0950 1.0808
irintensity: 0.1220 0.4258 0.0356 0.1789 3.8141 1.7224 0.7346 5.0974 2.1990 1.7262 5.5430 3.0461 22.2153 19.0051 18.6109 5.8893 29.5397 10.3648 13.1076 6.5573 1.6817 1.7998 20.2549 3.1248 22.8453 89.2556 1.6316 3.4259 2.1118 0.1372 10.8157 6.5008 1.3208 0.7278 52.7998 16.2952 50.9219 52.5424 10.3319 69.1485 60.2904 54.6178 34.9882 44.2928 194.2628 5.1331 3.1878 17.1325 8.2689 4.6921 5.3918 1.1389 99.5505 11.2771 16.6634 5.1770 5.7846 2.4103 11.2956 1.1889 0.0379 4.2310 0.7935 7.4071 6.6241 13.0911 42.2788 4.2473 9.9654 6.5100 3.2760 24.0401 2.2004 1.3415 5.0591 6.5908 33.9725 9.2372 17.2726 9.4164 6.9144 37.8432 20.2476 29.4361 1.5050 82.9661 20.3403 2.7352 27.3769 38.1880 40.0929 3.5256 22.4719 18.0387 4.5034 19.1063 1.4201 325.4296 26.4874 6.0054 2.6572 22.1077 100.8499 91.8268 2.7668 42.4010 37.6828 8.3744 41.8991 12.9586 16.0281 6.1830 0.2036 1.3318 9.9661 7.3173 35.1982 23.6093 40.1828 21.9003 8.6567 0.9654 3.1118 7.5229 2.6231 59.4529
temp: 298.150 k
press: 1.00000 atm
elementType: 8 7 7 7 6 6 6 6 6 6 6 6 6 6 6 6 6 6 6 6 6 6 6 6 6 1 1 1 1 1 1 1 1 1 1 1 1 1 1 1 1 1 1 1
symmnumber: 1
zpe: 925560.1 jmol-1
zpe.correction: 0.352527 hartree
zpe.thermalcorrener: 0.373376 hartree
zpe.thermalcorrenthalpy: 0.374320 hartree
zpe.thermalcorrgfe: 0.300717 hartree
zpe.sumelectzpe: -1049.411987 hartree
zpe.sumelectthermal: -1049.391138 hartree
zpe.sumelectthermalent: -1049.390194 hartree
zpe.sumelectthermalfe: -1049.463797 hartree
dipole: 0.0103 2.2798 -3.9980
dipole: 4.6024
quadrupole: -140.1500 -140.3953 -133.5835
quadrupole: -3.6451 13.2202 -6.5571
quadrupole: -2.1071 -2.3523 4.4594 -3.6451 13.2202 -6.5571
hfenergy: -1049.7645147 hartree
pointgroup: C01 [X(C21H19N3O1)]
dipole: -0.0767387 -0.9202237 -1.5575725 debye
polarizability: 331.1483661|62.2603326|218.5421611|-30.0855953|27.8217419|218.2357415 unknown
InChI: InChI=1S/C21H19N3O/c22-19(12-16-13-23-20-8-4-3-7-18(16)20)21(25)24-17-10-9-14-5-1-2-6-15(14)11-17/h1-11,13,19,23-24H,12,22H2
charge 0 multiplicity 1
44 atoms
O  1.338227 2.566455 1.231924
N  3.230731 -2.450604 -1.394477
N  3.428892 3.453202 -0.555609
N  0.408293 1.441055 -0.617464
C  3.77763 1.042224 -0.140027
C  3.372937 -0.386711 -0.40865
C  2.796606 2.125947 -0.691794
C  2.498338 -1.231116 0.394546
C  2.431186 -2.519612 -0.246213
C  3.797806 -1.169905 -1.484638
C  1.444308 2.062074 0.069725
C  1.773691 -1.025503 1.600401
C  1.673741 -3.590598 0.278925
C  -0.93891 1.213196 -0.214482
C  1.019453 -2.089414 2.129387
C  0.968927 -3.357733 1.477013
C  -3.142497 0.247175 -0.758049
C  -1.776128 0.502271 -1.088224
C  -3.665271 0.736136 0.502367
C  -1.452438 1.697733 1.038301
C  -2.783653 1.457463 1.372451
C  -4.017459 -0.478019 -1.635485
C  -5.036249 0.483329 0.834947
C  -5.349243 -0.709097 -1.284183
C  -5.865172 -0.224919 -0.038811
H  3.889939 1.214608 0.94879
H  4.754794 1.264415 -0.605372
H  2.63956 1.929538 -1.770787
H  4.478681 -0.912966 -2.294921
H  3.401355 -3.217625 -2.040575
H  1.794658 -0.054448 2.107398
H  1.63264 -4.566456 -0.218297
H  2.911368 4.192426 -1.04867
H  3.531736 3.7037 0.438176
H  0.668064 1.02849 -1.51763
H  0.452527 -1.943199 3.055241
H  0.36894 -4.163616 1.914368
H  -1.384419 0.12521 -2.042814
H  -0.783701 2.243951 1.705434
H  -3.172813 1.828158 2.328316
H  -3.624983 -0.850814 -2.589444
H  -5.426654 0.855406 1.789901
H  -6.007815 -1.263919 -1.961732
H  -6.911923 -0.413585 0.223536
