program: Gaussian 09
title: 000102936
version: EM64L-G09RevD.01
frameworkgroup: C1[X(C9H20O2)]
method: RPBEPBE
basis: SDD
operation: Freq
keyword: #pfreq=noraman
keyword: PBEPBE/SDD
title: #p freq=noraman PBEPBE/SDD
converged: YES YES NO NO
title: Mulliken charges:
elementType: O O C C C C C C C C C H H H H H H H H H H H H H H H H H H H H
charge: -0.456698 -0.436376 0.351970 -0.461491 -0.032319 -0.455773 -0.724182 -0.749206 -0.366089 -0.722313 -0.361160 0.196755 0.175937 0.230466 0.181410 0.227047 0.221187 0.207085 0.205314 0.210458 0.213378 0.212140 0.191445 0.183558 0.193006 0.206467 0.260207 0.198320 0.227440 0.343625 0.328390
chargesum: 0.00000
title: Mulliken charges with hydrogens summed into heavy atoms:
elementType: O O C C C C C C C C C
charge: -0.113073 -0.107986 0.351970 -0.088799 0.198147 -0.047315 -0.090595 -0.113229 0.008915 -0.062633 0.064600
polarizability: 1.15943700e+02 -3.52282224e+00 1.02919866e+02 -1.35954371e+00 3.90886548e-01 9.58000124e+01
1716.lowfreq: -19.9034 -14.8579 -0.0003 0.0001 0.0006 2.6882 20.7884 53.6378 91.9605
frequency: -6.2070 53.4095 91.9191 107.8502 134.8477 153.6895 175.5211 186.7272 225.2480 240.7308 249.0913 269.0306 284.4070 298.8252 311.6094 329.4293 352.3561 393.7075 419.0208 469.7166 488.4467 537.7045 762.6582 785.5932 826.6754 868.5520 894.8386 921.5974 926.2507 928.5748 955.1882 955.5514 984.6233 987.7794 1020.7115 1054.8752 1084.4535 1091.2755 1123.8565 1138.7992 1170.0864 1180.1775 1219.2990 1231.5166 1246.0952 1266.0558 1285.1317 1303.3562 1310.2146 1340.3062 1348.1987 1364.6593 1370.8843 1380.4230 1387.0997 1394.6594 1410.8212 1456.1294 1457.5655 1461.8445 1470.1364 1474.2955 1476.6889 1479.4621 1484.5567 1489.2159 1498.6035 2920.1071 2938.9801 2950.7737 2962.7613 2967.9096 2972.1412 2974.7437 2977.9022 2985.2388 3009.3891 3023.9217 3057.3454 3063.3701 3066.9032 3074.9211 3078.9176 3089.6072 3097.8269 3554.2359 3574.5875
redmass: 2.5680 5.5998 2.5312 2.2681 2.3863 2.4005 1.3188 2.0529 1.2117 1.0993 1.3922 2.7827 1.6172 2.1637 1.7085 2.5169 1.9937 2.8982 1.8974 2.5714 2.3708 2.7272 3.5513 1.2182 2.5813 1.6417 2.1746 1.3646 1.9194 1.3873 2.9201 1.9716 2.4785 1.8603 1.4950 2.8341 2.0514 1.6368 1.2425 1.8257 1.8939 1.6571 1.2709 1.7799 1.8645 1.3873 1.4964 1.1818 1.2410 1.4045 1.4191 1.3230 1.2189 1.2441 1.2502 1.2170 1.3464 1.0662 1.0641 1.0688 1.0663 1.0748 1.0569 1.0590 1.0773 1.0611 1.0530 1.0550 1.0593 1.0645 1.0588 1.0447 1.0982 1.0398 1.0403 1.0953 1.0915 1.0926 1.0994 1.0983 1.0990 1.0963 1.0965 1.0993 1.0965 1.0661 1.0666
irintensity: 1.8908 0.6756 8.8015 8.9211 0.5600 2.1026 0.4164 3.3962 4.4519 105.6122 43.4481 4.7687 13.8933 5.5281 85.2022 33.9707 10.8639 8.4810 1.7504 2.8506 0.8562 11.8933 0.1510 8.3323 6.0326 2.8608 2.2628 6.5055 12.7425 0.9058 65.6502 65.6699 19.3201 55.0948 1.0885 6.1984 11.8836 6.0395 26.3476 2.0502 24.4657 4.8329 8.8717 3.3033 8.1749 3.1497 26.6956 7.5367 7.0425 3.8335 3.8431 4.4270 10.4632 25.1168 19.5273 12.0310 2.8081 7.7728 3.7995 9.9125 1.7009 3.6466 2.6705 7.6657 0.8344 4.2365 43.8127 48.2738 59.5751 29.9919 11.3578 69.5605 48.1664 20.8115 39.0574 4.8698 85.9535 30.1452 2.5383 72.0737 50.3931 44.3458 49.5209 46.2246 24.9370 5.2258 2.2276
temp: 298.150 k
press: 1.00000 atm
elementType: 8 8 6 6 6 6 6 6 6 6 6 1 1 1 1 1 1 1 1 1 1 1 1 1 1 1 1 1 1 1 1
symmnumber: 1
zpe: 726038.8 jmol-1
zpe.correction: 0.276534 hartree
zpe.thermalcorrener: 0.290499 hartree
zpe.thermalcorrenthalpy: 0.291443 hartree
zpe.thermalcorrgfe: 0.237086 hartree
zpe.sumelectzpe: -504.431655 hartree
zpe.sumelectthermal: -504.417689 hartree
zpe.sumelectthermalent: -504.416745 hartree
zpe.sumelectthermalfe: -504.471102 hartree
dipole: 0.5446 -2.2594 1.8222
dipole: 2.9533
quadrupole: -61.4231 -80.6586 -69.5315
quadrupole: -1.7019 -8.6011 2.3213
quadrupole: 9.1147 -10.1209 1.0062 -1.7019 -8.6011 2.3213
hfenergy: -504.7081883 hartree
pointgroup: C01 [X(C9H20O2)]
dipole: -0.1469537 -0.9007051 -0.7191656 debye
polarizability: 115.3121439|4.4899141|103.5458817|-1.3730566|-0.4859586|95.8055529 unknown
InChI: InChI=1S/C9H20O2/c1-8(7-11)6-9(2,3)4-5-10/h8,10-11H,4-7H2,1-3H3
charge 0 multiplicity 1
31 atoms
O  3.459167 1.426561 -0.07076
O  -2.413241 2.55041 0.540137
C  -1.012373 -1.050732 -0.131617
C  0.387763 -0.698748 -0.745651
C  1.432682 0.083458 0.10166
C  -1.654783 0.171698 0.596944
C  -0.923612 -2.226143 0.882227
C  -1.923951 -1.522665 -1.302371
C  2.545029 0.572547 -0.848903
C  2.059056 -0.714749 1.269577
C  -1.899945 1.425016 -0.264388
H  0.851201 -1.648399 -1.090091
H  0.197877 -0.104765 -1.666125
H  0.960466 0.995935 0.517496
H  -2.626505 -0.157489 1.026896
H  -1.019839 0.469485 1.454279
H  -0.395736 -1.940169 1.807041
H  -0.391202 -3.088783 0.439313
H  -1.938375 -2.565381 1.166725
H  -2.943624 -1.753683 -0.939246
H  -1.514244 -2.441364 -1.763764
H  -2.008123 -0.760431 -2.098641
H  2.095354 1.150145 -1.685966
H  3.088598 -0.30164 -1.273828
H  2.395789 -1.713894 0.93038
H  1.347931 -0.8605 2.100136
H  2.9323 -0.16644 1.662464
H  -2.595578 1.205249 -1.101017
H  -0.958481 1.812029 -0.687899
H  4.178942 1.763095 -0.660521
H  -3.244542 2.259452 0.994512
