program: Gaussian 09
title: 000102935
version: EM64L-G09RevD.01
frameworkgroup: C1[X(C9H20O2)]
method: RPBEPBE
basis: SDD
operation: Freq
keyword: #pfreq=noraman
keyword: PBEPBE/SDD
title: #p freq=noraman PBEPBE/SDD
converged: YES YES NO NO
title: Mulliken charges:
elementType: O O C C C C C C C C C H H H H H H H H H H H H H H H H H H H H
charge: -0.470008 -0.437576 0.347173 -0.472881 -0.019813 -0.422824 -0.400558 -0.742126 -0.732877 -0.727371 -0.341981 0.197141 0.199941 0.189080 0.218008 0.182840 0.194214 0.201033 0.202429 0.220628 0.246525 0.200581 0.204248 0.248803 0.211662 0.212206 0.210612 0.211283 0.196605 0.342679 0.330324
chargesum: 0.00000
title: Mulliken charges with hydrogens summed into heavy atoms:
elementType: O O C C C C C C C C C
charge: -0.127330 -0.107253 0.347173 -0.075800 0.169266 -0.021975 -0.005310 -0.072543 -0.079246 -0.092891 0.065907
polarizability: 1.21192933e+02 -1.40103472e+00 9.80574073e+01 1.26178482e+00 -7.84517076e-02 9.65117593e+01
1716.lowfreq: -18.6572 -5.4973 -0.0005 0.0003 0.0005 7.6558 29.7033 54.3816 86.3326
frequency: 22.2125 54.2898 86.2820 98.3758 131.6337 156.6572 171.6802 204.7050 234.1163 236.1640 238.6436 260.5289 270.8641 299.4154 312.2064 341.7924 362.3932 406.7319 412.8215 434.2772 480.4670 580.6678 728.4249 784.8516 819.3797 858.7957 906.3554 920.3074 936.3992 942.5080 952.9941 962.5788 979.5361 992.2466 1012.9984 1047.2527 1071.3683 1095.7330 1126.9089 1143.1346 1154.8361 1170.3356 1221.2718 1233.9419 1261.6150 1266.3754 1281.1726 1307.9549 1308.7843 1333.7094 1342.4775 1359.6518 1369.9523 1379.8061 1383.9598 1390.5814 1409.8297 1452.4468 1456.5467 1462.1952 1466.6585 1471.4465 1474.8175 1481.4411 1483.0605 1489.5910 1499.3817 2922.4004 2944.0665 2950.8301 2958.8752 2966.9743 2971.8791 2973.1442 2983.1621 2987.5006 3012.4862 3023.2380 3059.9481 3061.9608 3069.0921 3076.8840 3082.2892 3096.1565 3101.1493 3558.9664 3579.7747
redmass: 2.6217 2.4608 3.4605 2.6428 2.8345 3.0256 2.4184 1.1055 1.2318 1.8277 1.1716 1.5946 2.2712 1.8253 1.2804 2.4898 2.2404 2.2168 2.8008 2.1898 2.8306 2.9832 2.8629 1.3288 2.1521 1.5553 1.7257 1.7854 1.8547 1.5140 2.6315 1.6287 5.2001 1.6677 1.5466 2.7591 1.5855 1.9049 1.5015 1.8709 1.3984 1.6218 1.8093 1.8708 1.3334 1.2302 1.3346 1.5893 1.2590 1.3111 1.4754 1.3142 1.2206 1.2550 1.2516 1.2217 1.3146 1.0765 1.0678 1.0750 1.0632 1.0535 1.0628 1.0822 1.0601 1.0548 1.0608 1.0563 1.0728 1.0613 1.0712 1.0663 1.0373 1.0369 1.1046 1.0375 1.0991 1.0946 1.0994 1.0992 1.0997 1.0985 1.0972 1.0984 1.0981 1.0661 1.0667
irintensity: 1.1677 5.8249 4.1615 1.2209 4.3200 3.2818 1.4604 14.0853 45.7345 8.7045 72.7019 0.6594 7.0137 6.3908 146.7585 2.2851 1.7242 1.1884 0.1598 6.0177 7.3402 5.4073 5.9459 4.7529 5.7935 4.0972 8.5073 0.3273 4.7325 2.6434 132.9875 3.8092 66.2034 7.3802 7.1953 10.9412 13.7283 13.2470 1.6280 1.4190 43.6639 17.1736 1.6956 0.1774 3.1311 11.4169 1.8310 3.9526 8.1009 9.8313 6.3311 1.7304 17.0707 21.9857 13.4679 20.7431 5.7515 2.2814 1.3257 2.2211 5.5924 3.5465 6.0926 8.0698 8.4622 10.3575 22.4357 68.7556 9.7938 9.5332 64.7355 42.8857 44.7501 29.0630 54.4146 28.9723 54.3473 24.8233 33.6844 50.0567 68.1671 23.1956 59.0947 22.8883 29.6297 7.2498 3.0576
temp: 298.150 k
press: 1.00000 atm
elementType: 8 8 6 6 6 6 6 6 6 6 6 1 1 1 1 1 1 1 1 1 1 1 1 1 1 1 1 1 1 1 1
symmnumber: 1
zpe: 725973.7 jmol-1
zpe.correction: 0.276509 hartree
zpe.thermalcorrener: 0.291402 hartree
zpe.thermalcorrenthalpy: 0.292346 hartree
zpe.thermalcorrgfe: 0.234779 hartree
zpe.sumelectzpe: -504.431447 hartree
zpe.sumelectthermal: -504.416554 hartree
zpe.sumelectthermalent: -504.415610 hartree
zpe.sumelectthermalfe: -504.473177 hartree
dipole: 0.4723 0.8698 0.0027
dipole: 0.9898
quadrupole: -86.9323 -73.1329 -63.5061
quadrupole: -2.5806 11.8927 0.9820
quadrupole: -12.4085 1.3909 11.0176 -2.5806 11.8927 0.9820
hfenergy: -504.7079561 hartree
pointgroup: C01 [X(C9H20O2)]
dipole: 0.1791489 -0.3344231 -0.0877434 debye
polarizability: 121.2098593|1.295858|97.9534788|-1.236448|0.2943472|96.5987612 unknown
InChI: InChI=1S/C9H20O2/c1-8(4-5-10)6-9(2,3)7-11/h8,10-11H,4-7H2,1-3H3
charge 0 multiplicity 1
31 atoms
O  3.317652 0.682201 -1.175625
O  -4.38614 0.994941 0.143123
C  1.576471 0.109267 0.444392
C  0.025013 0.014706 0.665755
C  -0.888251 -0.661647 -0.403217
C  -2.387687 -0.499814 -0.011249
C  1.868852 0.454415 -1.033804
C  2.317758 -1.194259 0.847931
C  2.108484 1.260641 1.344452
C  -0.591104 -2.164237 -0.633047
C  -2.922234 0.945214 -0.03201
H  -0.144659 -0.495692 1.638026
H  -0.340146 1.053334 0.800021
H  -0.749539 -0.133986 -1.371927
H  -3.009807 -1.086764 -0.715568
H  -2.546096 -0.939783 0.99819
H  1.302117 1.369795 -1.317212
H  1.548393 -0.380548 -1.69229
H  2.170028 -1.400048 1.924915
H  1.964114 -2.074135 0.285386
H  3.399488 -1.081237 0.659804
H  1.672335 2.233766 1.047321
H  1.842294 1.075328 2.402475
H  3.205158 1.341555 1.2639
H  0.402561 -2.332777 -1.082617
H  -1.341867 -2.606251 -1.314998
H  -0.629583 -2.724297 0.320923
H  -2.755025 1.404317 -1.021952
H  -2.42536 1.575934 0.733854
H  3.528772 0.874624 -2.122508
H  -4.614087 0.583634 1.015255
