program: Gaussian 09
title: 000102998
version: EM64L-G09RevD.01
frameworkgroup: C1[X(C17H18N2O6)]
method: RPBEPBE
basis: SDD
operation: Freq
keyword: #p
keyword: freq=noraman
keyword: PBEPBE/SDD
title: #p freq=noraman PBEPBE/SDD
converged: NO YES NO NO
title: Mulliken charges:
elementType: O O O O O O N N C C C C C C C C C C C C C C C C C H H H H H H H H H H H H H H H H H H
charge: -0.196394 -0.299379 -0.169179 -0.290442 -0.201929 -0.165793 -0.187024 -0.126531 -0.207424 -0.467599 -0.471316 -0.345674 0.283468 0.299400 -0.500011 -0.500264 0.227854 0.204905 -0.415143 0.475576 -0.375231 -0.401844 -0.224189 -0.225352 -0.232920 0.315226 0.239371 0.276002 0.236433 0.249721 0.255571 0.233159 0.271402 0.269206 0.269302 0.271573 0.224402 0.242043 0.239670 0.233440 0.228025 0.227814 0.230071
chargesum: 0.00000
title: Mulliken charges with hydrogens summed into heavy atoms:
elementType: O O O O O O N N C C C C C C C C C C C C C C C C C
charge: -0.196394 -0.299379 -0.169179 -0.290442 -0.201929 -0.165793 -0.187024 -0.126531 0.107802 0.047775 0.014838 0.143057 0.283468 0.299400 0.040598 0.040611 0.227854 0.204905 0.051301 0.475576 -0.135561 -0.168403 0.003836 0.002463 -0.002849
polarizability: 2.73452893e+02 -1.29858556e+01 1.87162587e+02 -2.74198721e+00 1.05872213e-01 1.79392203e+02
1716.lowfreq: -14.1724 -10.4928 -8.2430 -4.9734 -4.2460 -0.0002 0.0001 0.0007 15.2495
frequency: -13.2638 -9.4986 15.1602 18.3610 39.0241 41.3007 45.2492 64.1347 75.2891 81.0015 105.0641 120.6231 129.9702 139.9867 157.9171 182.2646 224.8794 239.8780 282.8087 295.7759 312.2386 324.2506 337.0327 374.4474 394.2058 401.5276 479.7147 533.1582 536.7295 546.1547 550.5693 562.8538 571.1134 596.7536 617.2503 632.1655 641.7773 673.5860 698.3926 700.9945 710.9368 722.7540 755.5964 780.6921 818.6059 834.8375 850.6721 852.6616 864.6601 887.0781 892.9332 915.4394 927.2525 957.9532 968.8645 976.2201 984.1730 991.2225 996.5276 998.7911 1006.4641 1018.6491 1026.1602 1029.4310 1039.6066 1069.5494 1088.5730 1103.3089 1147.2596 1160.4868 1161.3694 1168.4479 1172.7332 1187.5220 1192.9965 1195.6744 1209.6015 1228.8401 1228.9315 1232.6364 1255.3873 1292.2986 1295.4101 1302.8610 1306.7709 1323.2749 1325.5387 1339.4862 1353.5684 1384.6095 1390.4571 1437.3084 1440.7136 1453.1600 1470.0413 1477.1222 1477.7301 1487.9754 1494.2804 1597.1366 1618.1063 1635.3526 1659.1276 1704.6861 1735.0595 2999.6014 3014.3905 3022.2988 3027.4256 3030.5221 3039.5081 3062.2220 3074.0598 3077.9548 3085.8592 3093.7087 3103.0758 3106.2701 3122.3246 3125.8626 3137.8174 3149.6633 3166.1103
redmass: 3.8947 4.5746 7.5121 5.3257 5.1515 5.2758 5.4321 4.3542 6.1817 2.3419 5.6848 5.7082 4.6383 6.0688 3.4673 6.3262 3.6525 3.6478 5.3540 7.4178 3.5081 3.9217 6.5320 7.2664 6.7331 2.7950 4.0198 4.1969 4.4192 3.4109 3.3225 4.3910 4.0590 4.3225 6.3390 6.3152 6.8329 4.7394 8.5412 1.9461 6.0791 6.9151 1.9662 3.9520 1.4804 4.6441 2.9424 1.3388 2.1910 2.2487 2.8884 2.4181 1.6027 1.7066 2.2653 1.3948 4.6056 6.1712 1.3251 3.0990 2.1818 5.4830 2.4818 3.0014 4.5084 2.0604 1.5143 2.0270 1.1945 1.3265 1.7654 7.8350 1.0535 1.1166 1.6386 1.3157 1.1133 2.0625 2.3016 1.5398 1.9385 2.0299 1.6555 1.2943 2.0224 1.3162 1.2904 1.3713 1.4876 5.0269 3.7938 1.0737 2.1948 1.0901 1.0823 1.0884 1.1016 2.4047 1.0870 6.1703 6.2053 11.9054 12.5608 12.2885 11.8016 1.0647 1.0578 1.0634 1.0630 1.0594 1.0631 1.0857 1.0991 1.1076 1.1035 1.1024 1.1020 1.1056 1.0859 1.0875 1.0920 1.0964 1.1017
irintensity: 0.0814 0.0097 0.2045 1.1522 3.8860 1.4654 0.8032 0.2688 4.5925 0.3227 11.3223 1.0206 1.8181 1.4413 1.5943 1.9128 3.4596 10.6186 7.6041 3.5603 3.1564 0.6877 10.7588 14.6036 11.6817 0.1210 7.5733 4.3179 4.6707 2.2786 2.2391 6.4092 22.3371 9.3731 0.1987 37.6291 23.3733 3.4574 14.1494 48.1231 9.0531 10.5886 55.1710 113.2020 17.6057 26.0992 6.7141 1.5073 7.6602 154.1996 48.5736 41.9418 1.8333 2.5632 11.2857 0.1311 320.8669 0.4254 0.1284 22.7259 2.8353 12.0676 74.2606 82.7337 20.5088 73.9205 6.7505 35.9433 1.0572 9.9372 29.6762 225.6830 0.0354 0.5755 15.0804 19.4742 0.0431 30.9007 24.7761 33.0279 32.8869 41.7804 15.1803 10.9204 358.6105 3.2670 10.8536 24.6966 8.4713 116.3612 132.7309 0.9080 8.8309 27.3788 13.3263 14.6491 8.7855 6.6171 6.9241 0.6858 0.3429 212.1077 638.9439 98.6929 68.0897 37.1087 25.5961 19.2629 17.8771 11.0085 2.0155 6.4371 11.4419 13.0838 0.1554 14.6735 5.5548 27.3988 5.3756 1.3589 14.8693 40.2615 21.7838
temp: 298.150 k
press: 1.00000 atm
elementType: 8 8 8 8 8 8 7 7 6 6 6 6 6 6 6 6 6 6 6 6 6 6 6 6 6 1 1 1 1 1 1 1 1 1 1 1 1 1 1 1 1 1 1
symmnumber: 1
zpe: 866071.5 jmol-1
zpe.correction: 0.329869 hartree
zpe.thermalcorrener: 0.351594 hartree
zpe.thermalcorrenthalpy: 0.352538 hartree
zpe.thermalcorrgfe: 0.275124 hartree
zpe.sumelectzpe: -1217.609349 hartree
zpe.sumelectthermal: -1217.587625 hartree
zpe.sumelectthermalent: -1217.586681 hartree
zpe.sumelectthermalfe: -1217.664095 hartree
dipole: 0.7417 2.2370 2.6629
dipole: 3.5560
quadrupole: -104.0279 -143.6766 -145.5448
quadrupole: -9.7305 7.4036 -15.2301
quadrupole: 27.0552 -12.5935 -14.4617 -9.7305 7.4036 -15.2301
hfenergy: -1217.9392185 hartree
pointgroup: C01 [X(C17H18N2O6)]
dipole: 0.3061555 -0.8686653 -1.0531072 debye
polarizability: 272.5311743|15.8870543|188.1446092|1.3860244|-0.0255117|179.3319 unknown
InChI: InChI=1S/C17H18N2O6/c20-14-8-9-15(21)19(14)25-16(22)13-7-4-10-18(13)17(23)24-11-12-5-2-1-3-6-12/h1-3,5-6,13H,4,7-11H2
charge 0 multiplicity 1
43 atoms
O  3.154958 -0.098934 0.904272
O  -2.470166 -0.365606 0.639347
O  1.66283 0.32663 -0.890458
O  -0.758738 0.675799 1.89507
O  4.660371 -1.256505 -1.236763
O  3.93522 2.716456 1.197404
N  -0.350894 -1.220005 0.586216
N  4.137527 0.593594 0.142972
C  1.070617 -1.291368 0.937187
C  1.478997 -2.725123 0.467255
C  0.54051 -2.981327 -0.740623
C  -0.789405 -2.293836 -0.344107
C  1.895869 -0.253553 0.170063
C  -1.149583 -0.228211 1.107143
C  5.797136 0.975449 -1.477083
C  5.578974 2.270603 -0.64843
C  4.839386 -0.067471 -0.898206
C  4.462944 1.964559 0.359808
C  -3.423566 0.66948 1.163467
C  -4.676794 0.601039 0.326307
C  -4.723769 1.229649 -0.943988
C  -5.824309 -0.084491 0.796272
C  -5.89367 1.170505 -1.731613
C  -6.998703 -0.143113 0.012128
C  -7.035401 0.484362 -1.254159
H  1.236436 -1.12981 2.014922
H  1.267382 -3.431772 1.289345
H  2.548141 -2.792107 0.21018
H  0.405109 -4.056016 -0.943085
H  0.956509 -2.510077 -1.648106
H  -1.326535 -1.862724 -1.204676
H  -1.479411 -2.984853 0.175644
H  5.557636 1.110169 -2.54565
H  6.828893 0.590188 -1.418331
H  6.4795 2.577896 -0.089907
H  5.267125 3.129149 -1.266039
H  -3.619211 0.445794 2.227206
H  -2.92201 1.651314 1.101856
H  -3.839576 1.762642 -1.313297
H  -5.796334 -0.573883 1.777367
H  -5.918949 1.661071 -2.710857
H  -7.88088 -0.673578 0.387107
H  -7.945764 0.442116 -1.862459
