program: Gaussian 09
title: 000102925
version: EM64L-G09RevD.01
frameworkgroup: C1[X(C7H10O2)]
method: RPBEPBE
basis: SDD
operation: Freq
keyword: #pfreq=noraman
keyword: PBEPBE/SDD
title: #p freq=noraman PBEPBE/SDD
converged: YES YES NO NO
title: Mulliken charges:
elementType: O O C C C C C C C H H H H H H H H H H
charge: -0.157228 -0.163012 -0.035956 -0.414000 -0.505376 -0.505643 -0.715211 0.090159 0.122497 0.217316 0.225578 0.209609 0.231425 0.251958 0.236095 0.253056 0.223093 0.211367 0.224274
chargesum: 0.00000
title: Mulliken charges with hydrogens summed into heavy atoms:
elementType: O O C C C C C C C
charge: -0.157228 -0.163012 0.181359 0.021187 -0.021993 -0.016492 -0.056477 0.090159 0.122497
polarizability: 9.15768548e+01 1.33033430e+00 7.79236436e+01 7.54388000e-01 -8.30830908e-01 5.89227733e+01
1716.lowfreq: -28.2384 -18.3932 -0.0005 -0.0002 0.0004 6.1909 53.1704 94.3293 194.5731
frequency: 52.7135 94.2921 194.5721 210.5858 257.3191 290.9445 324.6213 370.2352 392.1497 441.6005 516.1674 636.4905 650.1848 705.6077 793.7687 856.7414 874.7425 926.5955 951.4744 1004.9225 1035.6301 1077.8687 1085.2148 1121.6320 1129.0786 1195.9224 1237.5475 1246.4292 1274.3683 1290.5559 1313.0008 1327.0979 1350.3681 1393.4922 1431.9213 1437.4301 1469.1226 1475.7773 1477.5270 1618.3828 1629.4736 2951.1466 2961.7730 2968.3701 2973.4075 2982.8892 3044.1301 3060.4977 3067.1021 3070.0632 3077.3225
redmass: 5.5492 3.1582 1.9832 1.1489 3.4298 2.8645 8.6686 3.5827 2.9405 2.3797 2.7607 4.6527 2.9281 3.6381 2.1280 1.6497 2.3696 1.7514 1.5087 1.7325 2.4778 1.7006 1.8361 2.6230 2.1553 2.2529 1.4949 1.5940 1.3478 1.3209 1.3907 1.3565 1.5782 1.2097 1.0868 1.0846 1.0814 1.0513 1.0528 10.9566 11.5640 1.0674 1.0659 1.0775 1.0378 1.0632 1.1005 1.0959 1.0952 1.0990 1.0995
irintensity: 0.7165 3.8782 0.4920 0.1184 5.2355 0.4632 3.0289 0.7883 3.2505 2.9181 6.0590 2.0495 0.5348 5.5011 2.1342 6.3177 12.2656 7.5364 4.5407 23.5335 15.2116 1.7741 2.0885 27.2504 21.0056 9.4195 14.1891 25.8933 0.9956 1.0243 0.2021 12.1498 0.7838 11.7892 17.2014 19.9179 4.4325 10.7795 18.1325 183.0764 53.0545 3.0235 8.8197 13.1880 19.7956 55.7108 26.8068 8.2057 10.8427 62.1247 35.4123
temp: 298.150 k
press: 1.00000 atm
elementType: 8 8 6 6 6 6 6 6 6 1 1 1 1 1 1 1 1 1 1
symmnumber: 1
zpe: 408646.0 jmol-1
zpe.correction: 0.155645 hartree
zpe.thermalcorrener: 0.164595 hartree
zpe.thermalcorrenthalpy: 0.165539 hartree
zpe.thermalcorrgfe: 0.121594 hartree
zpe.sumelectzpe: -422.478684 hartree
zpe.sumelectthermal: -422.469734 hartree
zpe.sumelectthermalent: -422.468789 hartree
zpe.sumelectthermalfe: -422.512735 hartree
dipole: -5.3619 -1.8510 -0.3078
dipole: 5.6808
quadrupole: -65.4791 -56.3155 -51.9622
quadrupole: -2.8376 -1.2740 2.9869
quadrupole: -7.5602 1.6035 5.9567 -2.8376 -1.2740 2.9869
hfenergy: -422.6343289 hartree
pointgroup: C01 [X(C7H10O2)]
dipole: 2.1335177 -0.6614748 0.0755546 debye
dipolederiv: -0.6563208 0.1191786 0.1108741 0.1900995 -0.632784 -0.1125917 0.224262 -0.1469291 -0.3304033 -0.7644532 -0.0362827 -0.1750711 -0.0893811 -0.4893347 -0.02723 -0.2698658 -0.0080823 -0.3476016 0.133413 -0.0519615 0.0347258 -0.1526463 0.134377 0.0183022 0.0926206 -0.0047798 0.1609353 0.1182504 -0.0408923 0.0090602 0.0370637 0.0134883 0.0060509 -0.027308 0.0118496 0.1504196 -0.4802649 0.0457213 0.1161251 -0.0094816 -0.0591941 0.0120051 0.1218983 -0.0019848 0.0779641 -0.2646342 0.1027524 -0.1052449 0.146415 -0.1660482 0.089309 -0.1467525 0.0882721 0.05959 -0.052034 -0.0212168 0.0265176 0.0012738 0.0271417 0.0063451 -0.0164138 0.0047581 0.0937365 0.9416985 -0.034254 -0.2969455 -0.0210843 0.5441097 0.15609 -0.3822905 0.2042887 0.2132186 0.7926478 -0.1362499 0.3554805 -0.1398974 0.6303181 -0.065764 0.4469393 -0.0476211 0.2456205 0.0310992 0.0106433 0.0443207 0.0136571 0.0246254 0.0092722 0.0035962 -0.0010913 -0.1757356 -0.070803 0.1249796 -0.0444328 0.0957551 -0.0595894 0.0393045 -0.0502409 0.061601 0.0601457 0.0382122 -0.0228444 0.015677 -0.0316611 0.0672419 0.0262916 0.044521 -0.0382462 -0.1576153 0.0785381 0.0051631 0.017966 -0.020165 0.116333 -0.0409261 -0.0158239 0.0124698 -0.0903316 0.0271769 -0.0403306 -0.0122734 -0.0418433 -0.1086755 -0.0380786 -0.0358937 -0.0613705 0.0805877 0.0810827 0.0160196 -0.0064631 0.0466395 0.1064035 -0.0301384 0.0393449 0.0045143 -0.0908726 -0.0007519 -0.0669158 -0.0210666 -0.0528725 -0.092752 -0.0357264 -0.0093757 -0.075088 0.0860374 -0.059438 0.0869199 -0.0360215 0.1466347 -0.024033 0.072598 -0.0528932 0.0688915 0.055796 0.0626468 -0.0070919 -0.0324364 0.0000777 0.0920386 -0.0185251 0.0500299 0.0000258 -0.1619797 0.0439344 -0.053338 -0.0007917 -0.1185836 -0.1236664 -0.0665885 -0.0163543 -0.0714778 0.0704881 unknown
polarizability: 91.6486854|-0.9117528|77.5917889|0.7592008|2.3430763|59.1827974 unknown
InChI: InChI=1S/C7H10O2/c1-5-2-3-6(8)7(9)4-5/h5H,2-4H2,1H3
charge 0 multiplicity 1
19 atoms
O  -1.612865 1.767032 0.547309
O  -2.424504 -0.817141 -0.604941
C  1.604063 0.094572 0.303884
C  1.149079 -1.31193 -0.155979
C  0.631928 1.176442 -0.253554
C  -0.296156 -1.639933 0.305809
C  3.055851 0.392993 -0.127374
C  -0.823699 0.898118 0.10105
C  -1.29465 -0.567662 -0.118071
H  1.554422 0.127398 1.413012
H  1.838938 -2.078647 0.244225
H  1.210204 -1.372136 -1.261679
H  0.715324 1.174062 -1.362827
H  0.896932 2.189658 0.097593
H  -0.312767 -1.684229 1.416342
H  -0.644116 -2.618478 -0.068878
H  3.755837 -0.351023 0.295218
H  3.153316 0.362278 -1.229561
H  3.379862 1.393326 0.213023
