program: Gaussian 09
title: 000102921
version: EM64L-G09RevD.01
frameworkgroup: C1[X(C3H8OS)]
method: RPBEPBE
basis: SDD
operation: Freq
keyword: #pfreq=noraman
keyword: PBEPBE/SDD
title: #p freq=noraman PBEPBE/SDD
converged: YES YES NO NO
title: Mulliken charges:
elementType: S O C C C H H H H H H H H
charge: -0.051891 -0.427131 -0.439244 -0.276335 -0.622372 0.263324 0.217068 0.198870 0.218801 0.235144 0.243104 0.103204 0.337457
chargesum: 0.00000
title: Mulliken charges with hydrogens summed into heavy atoms:
elementType: S O C C C
charge: 0.051314 -0.089674 -0.175920 0.139603 0.074677
polarizability: 5.69229417e+01 -7.07384115e+00 5.23100217e+01 -2.90659607e+00 -1.22339099e+00 4.73690608e+01
1716.lowfreq: -19.6835 0.0011 0.0017 0.0027 7.1724 15.7922 142.1341 198.2681 235.8704
frequency: 142.0849 198.2186 235.8665 272.4694 305.3857 338.4742 483.0123 547.5412 634.8750 808.9005 855.3825 926.8358 957.6430 1023.6399 1107.3259 1114.0534 1177.7191 1236.8174 1281.0774 1343.8922 1377.6112 1395.8873 1459.9431 1469.6964 1476.4900 2421.9006 2944.4606 2990.9377 3043.1131 3053.9110 3085.7200 3106.4288 3447.5166
redmass: 3.6503 1.2020 2.9598 1.2120 2.5674 1.9867 1.3967 2.2056 3.1302 1.1760 2.7509 1.5715 2.0638 1.6035 1.7636 1.4071 1.4975 1.2901 1.3854 1.3241 1.1983 1.2197 1.0669 1.0593 1.0484 1.0382 1.0680 1.0364 1.0873 1.0942 1.0978 1.1010 1.0647
irintensity: 9.0037 0.9658 1.0049 12.6876 9.7155 2.7556 112.3030 66.0709 2.4032 5.6230 5.5008 17.3525 38.3633 33.7752 12.8180 22.9636 8.1529 27.5505 19.2577 13.5450 35.7896 17.5453 5.0357 13.8821 10.6933 30.6799 73.1369 18.8962 19.6753 26.9162 25.6170 19.1550 14.1031
temp: 298.150 k
press: 1.00000 atm
elementType: 16 8 6 6 6 1 1 1 1 1 1 1 1
symmnumber: 1
zpe: 276725.1 jmol-1
zpe.correction: 0.105399 hartree
zpe.thermalcorrener: 0.112172 hartree
zpe.thermalcorrenthalpy: 0.113117 hartree
zpe.thermalcorrgfe: 0.075194 hartree
zpe.sumelectzpe: -591.950752 hartree
zpe.sumelectthermal: -591.943978 hartree
zpe.sumelectthermalent: -591.943034 hartree
zpe.sumelectthermalfe: -591.980957 hartree
dipole: 0.7723 0.5770 2.1608
dipole: 2.3661
quadrupole: -46.3236 -37.0628 -37.6235
quadrupole: -3.8525 -1.5127 -1.0464
quadrupole: -5.9870 3.2738 2.7132 -3.8525 -1.5127 -1.0464
hfenergy: -592.0561508 hartree
pointgroup: C01 [X(C3H8O1S1)]
dipole: -0.4049121 0.0289338 -0.8377238 debye
dipolederiv: -0.3550169 -0.069339 -0.119688 -0.0949994 -0.270156 0.1635317 -0.1051693 0.1057941 0.0298335 -0.6058148 0.2007517 -0.1216226 0.204909 -0.3722553 0.0019783 -0.0980568 -0.0261161 -0.6199763 0.1383635 0.1667312 -0.0560393 0.2042523 0.5096683 -0.1579528 -0.01061 -0.069456 0.08475 0.3085406 -0.0549221 0.0800708 -0.1491597 0.1723803 -0.0016511 0.1229017 0.0415722 0.500252 -0.017679 -0.0092032 0.0269128 0.0132728 -0.1065511 -0.0856538 0.0320329 0.0269653 -0.004087 -0.0035721 -0.0189937 -0.0485843 -0.0088567 -0.0304029 0.0345937 -0.0512318 0.039633 -0.1384968 -0.0080035 -0.1091989 0.0467146 -0.0767429 -0.0578855 0.1059085 -0.0079835 0.053787 0.0377336 0.0173125 0.0343335 -0.0202183 0.0649654 -0.0879511 -0.1731554 0.0066145 -0.1032065 -0.1347794 0.0780568 -0.083191 0.053069 -0.0639273 -0.1048104 0.0622238 0.0414898 0.0714593 0.0478798 -0.1333557 0.0616337 0.0314963 0.0161678 0.0945533 -0.0082763 0.0263295 -0.0284985 0.0951589 0.0884506 -0.0048243 -0.0905538 0.0141673 0.1071814 0.0514506 -0.0619237 -0.0213273 -0.0642733 0.1185735 0.0340741 0.1169071 -0.0169194 -0.0459297 -0.0558422 0.0786973 -0.1266248 -0.086643 0.3741446 -0.1478522 0.1015357 -0.1071291 0.1921587 0.062845 0.0269094 0.0360182 0.2526481 unknown
polarizability: 50.1025307|5.9235701|58.8270258|-3.5240533|-0.9471062|47.6724677 unknown
InChI: InChI=1S/C3H8OS/c1-3(5)2-4/h3-5H,2H2,1H3
charge 0 multiplicity 1
13 atoms
S  -1.318554 -1.321284 0.280238
O  1.666513 -0.313553 0.626497
C  -0.483019 0.211633 -0.540622
C  1.034657 -0.046454 -0.66361
C  -0.826213 1.429653 0.331223
H  -0.931438 0.310323 -1.54503
H  1.534026 0.861153 -1.048344
H  1.216296 -0.879146 -1.378301
H  -0.432809 2.347071 -0.144731
H  -1.916315 1.543172 0.455569
H  -0.356118 1.34029 1.325857
H  -1.049524 -2.211624 -0.750192
H  1.118998 -1.018933 1.071847
