program: Gaussian 09
title: 000102918
version: EM64L-G09RevD.01
frameworkgroup: C1[X(C6H7ClO3)]
method: RPBEPBE
basis: SDD
operation: Freq
keyword: #p
keyword: freq=noraman
keyword: PBEPBE/SDD
title: #p freq=noraman PBEPBE/SDD
converged: YES YES NO NO
title: Mulliken charges:
elementType: Cl O O O C C C C C C H H H H H H H
charge: -0.010967 -0.189198 -0.187503 -0.187748 -0.297653 -0.456942 -0.293111 0.285602 0.246198 -0.759228 0.279902 0.275648 0.244331 0.246928 0.259037 0.290822 0.253881
chargesum: 0.00000
title: Mulliken charges with hydrogens summed into heavy atoms:
elementType: Cl O O O C C C C C C
charge: -0.010967 -0.189198 -0.187503 -0.187748 -0.297653 0.098609 0.198149 0.285602 0.246198 0.044512
polarizability: 8.51961801e+01 1.67993206e+00 7.74547518e+01 7.56719398e+00 4.24264998e+00 7.38805724e+01
1716.lowfreq: -8.9817 -0.7626 -0.0019 -0.0016 -0.0011 8.4930 52.6511 87.6468 138.5483
frequency: 52.6127 87.6361 138.5246 155.3096 186.0964 196.3773 222.6089 313.2645 353.0298 365.6003 478.2004 563.5340 572.3131 583.4081 652.4764 671.7148 742.9208 852.1652 909.8734 920.5002 958.1344 1007.4731 1034.8069 1064.3934 1076.0177 1119.6842 1171.8027 1205.2610 1225.7731 1308.8378 1339.6400 1376.9289 1440.3975 1450.6886 1451.4069 1477.6202 1623.4082 1689.8160 2990.6076 3030.4125 3043.6927 3076.0677 3113.5617 3130.1746 3132.6804
redmass: 5.4879 5.2795 1.6413 3.8403 3.1071 3.0759 4.6268 2.7657 4.1045 8.5207 4.7737 4.3057 4.3744 4.4775 3.9984 6.2967 3.9827 1.8719 4.2588 4.3943 2.4533 2.6503 1.8767 4.7095 1.8619 3.5542 1.1699 1.2613 3.4441 1.5403 1.3540 1.2469 1.0578 1.0780 1.0804 1.0857 8.4955 12.5378 1.0372 1.0645 1.0608 1.0951 1.0999 1.1081 1.1010
irintensity: 7.8736 0.9961 1.7128 5.8564 0.1173 4.7981 14.5061 0.2937 2.2855 2.5464 2.2354 10.1654 24.0451 13.2047 7.2429 2.7897 3.2719 13.2813 34.1963 41.6850 23.1081 20.7299 8.6433 156.8532 15.9171 61.9587 24.8373 2.7073 80.2408 7.4519 0.8533 88.3747 28.6418 39.6593 11.9538 6.5747 102.8488 249.1956 3.7785 0.5341 28.8540 1.2159 3.6834 11.2953 6.8190
temp: 298.150 k
press: 1.00000 atm
elementType: 17 8 8 8 6 6 6 6 6 6 1 1 1 1 1 1 1
symmnumber: 1
zpe: 320344.7 jmol-1
zpe.correction: 0.122013 hartree
zpe.thermalcorrener: 0.132099 hartree
zpe.thermalcorrenthalpy: 0.133043 hartree
zpe.thermalcorrgfe: 0.085905 hartree
zpe.sumelectzpe: -917.800412 hartree
zpe.sumelectthermal: -917.790326 hartree
zpe.sumelectthermalent: -917.789382 hartree
zpe.sumelectthermalfe: -917.836519 hartree
dipole: -0.9367 0.7760 -2.9750
dipole: 3.2141
quadrupole: -60.1136 -68.5316 -71.9741
quadrupole: 4.0819 9.6133 -0.2713
quadrupole: 6.7595 -1.6585 -5.1010 4.0819 9.6133 -0.2713
hfenergy: -917.9224246 hartree
pointgroup: C01 [X(C6H7Cl1O3)]
dipole: -0.4187988 -1.1423143 0.3446148 debye
dipolederiv: -0.2174873 0.0161741 0.0192583 0.038607 -0.2815367 -0.1958475 0.0599143 -0.1421481 -0.4223174 -1.1543063 -0.3221608 0.2668867 -0.006324 -0.5171427 0.1189767 0.1695671 0.2076806 -0.3640181 -0.6623569 -0.1482306 0.1115349 -0.212829 -0.8320713 0.2750962 0.1763107 0.2891606 -0.41679 -0.5797188 -0.0790457 -0.1126807 -0.0843738 -0.2579303 0.0617608 -0.1075596 0.0892898 -0.8426373 -0.3006915 0.0581838 -0.2257218 0.0856139 0.1063332 0.3182836 -0.2569046 0.367767 0.4568687 -0.1538458 0.0106752 -0.0173856 -0.0525052 -0.0652925 0.028683 0.0481786 -0.0038877 -0.1269247 0.3337145 0.0339403 -0.0514213 0.2224756 0.4663999 -0.0567497 -0.1211656 -0.0875201 0.3638675 1.4850651 0.2771525 -0.3742352 -0.088762 1.0952258 -0.4049072 -0.2353166 -0.4810177 0.3589134 1.097584 0.2391045 0.1866576 0.2702512 0.0681276 -0.121658 0.1477271 -0.1772759 0.9065274 -0.3371681 -0.0780286 0.1961326 -0.0465983 -0.0458414 0.0934956 0.2101635 0.1174027 -0.2791136 0.1012506 0.017788 -0.0124108 -0.00938 0.092026 -0.0575322 -0.0024769 -0.0606719 0.0052808 0.0978457 0.0187811 0.0003296 0.0057668 -0.0512752 0.0344703 -0.0145054 0.0107726 0.1181845 0.0581722 -0.030451 -0.0234462 -0.1088019 -0.0385949 -0.0295889 -0.0684983 -0.0596501 -0.0231812 -0.0195033 0.003639 0.0793016 0.0252555 0.0601426 -0.0172857 0.120915 0.0092612 0.0096799 0.1255774 -0.0218674 0.019882 0.0289776 0.0135806 -0.0879834 0.0108637 -0.0758831 0.0965533 0.1612298 0.0569367 -0.0108056 -0.0095126 0.0741881 0.0504905 -0.0395919 0.0280414 0.1144988 -0.0353613 -0.0525911 -0.0518762 -0.0578609 0.113661 -0.0097041 -0.097621 -0.0313212 0.0446079 unknown
polarizability: 86.1275999|5.1320289|70.813703|-5.1068448|0.2798967|79.5902014 unknown
InChI: InChI=1S/C6H7ClO3/c1-4(8)6(7)2-3-10-5(6)9/h2-3H2,1H3
charge 0 multiplicity 1
17 atoms
Cl 0.377834 -1.979688 -1.43706
O  -1.835823 0.396602 -0.196149
O  0.072285 1.430183 -1.026542
O  1.761981 -0.689067 1.94336
C  0.21096 -0.827978 0.097055
C  -0.834191 -1.4110 1.048765
C  -2.168659 -0.910753 0.459632
C  -0.462283 0.467289 -0.459385
C  1.62111 -0.582477 0.698358
C  2.73061 -0.169498 -0.237291
H  -0.649185 -0.984553 2.051393
H  -0.777877 -2.506693 1.12599
H  -2.565738 -1.578321 -0.32352
H  -2.941143 -0.694015 1.211292
H  3.001577 -1.004677 -0.908033
H  2.383398 0.658795 -0.882997
H  3.611345 0.136053 0.346731
