program: Gaussian 09
title: 000102911
version: EM64L-G09RevD.01
frameworkgroup: C1[X(C7H14O2)]
method: RPBEPBE
basis: SDD
operation: Freq
keyword: #pfreq=noraman
keyword: PBEPBE/SDD
title: #p freq=noraman PBEPBE/SDD
converged: YES YES NO NO
title: Mulliken charges:
elementType: O O C C C C C C C H H H H H H H H H H H H H H
charge: -0.312435 -0.455965 -0.008702 -0.083558 -0.443566 -0.430140 -0.391556 -0.394913 -0.510158 0.195316 0.195247 0.202034 0.210800 0.223784 0.207546 0.195599 0.204466 0.197236 0.205476 0.346722 0.234471 0.209479 0.202813
chargesum: 0.00000
title: Mulliken charges with hydrogens summed into heavy atoms:
elementType: O O C C C C C C C
charge: -0.312435 -0.109243 0.186615 0.111689 -0.030731 0.001191 0.008509 0.007799 0.136606
polarizability: 9.35747159e+01 -5.39057074e-02 7.97812348e+01 1.29754072e-01 5.54125546e-01 6.59886570e+01
1716.lowfreq: -17.9325 -7.3763 -0.0008 -0.0007 -0.0006 27.9242 78.4763 112.5267 159.4531
frequency: 78.3272 112.4919 159.4508 179.7296 223.1032 266.8598 311.5592 359.4571 407.4700 421.5111 457.0444 494.1200 503.9441 543.1385 782.0633 824.6122 836.9121 879.7493 895.5014 942.2834 959.5746 1032.4653 1045.4558 1051.6345 1058.4170 1100.7457 1107.2218 1116.1289 1128.6828 1153.0815 1205.2753 1228.8464 1239.0343 1259.8387 1295.1490 1300.0635 1320.1679 1328.9242 1336.0867 1341.8418 1366.9458 1390.0264 1436.2785 1461.1289 1464.8437 1465.9236 1470.8596 1476.2255 1479.5406 2922.8334 2936.9762 2940.0154 2971.3457 2974.6600 2983.5696 2991.2630 3018.3065 3036.0362 3039.3942 3048.9733 3061.1513 3099.5990 3517.0523
redmass: 2.4664 2.7431 2.5267 1.4378 2.1731 3.3235 1.7357 2.9715 3.2566 3.4124 2.9219 1.3983 2.2226 2.1028 1.8297 2.2289 1.8216 2.1031 1.7047 2.3907 2.7228 2.1197 1.9305 3.5660 2.0106 2.2058 1.4546 1.3593 2.0912 1.4163 1.5244 1.2939 1.2956 1.2119 1.2686 1.2794 1.2794 1.3847 1.4056 1.4943 1.4198 1.7731 1.1331 1.0603 1.0905 1.0892 1.0812 1.0690 1.0775 1.0805 1.0407 1.0785 1.0644 1.0623 1.0608 1.0628 1.1017 1.0959 1.0997 1.1025 1.1019 1.0984 1.0646
irintensity: 2.2138 3.4332 1.6864 0.5333 6.8563 11.1622 0.2924 0.6522 1.0104 19.4320 3.2158 99.2328 55.3695 7.5924 2.1079 9.4567 13.1554 5.6684 13.1587 5.6747 17.4427 46.7345 43.0603 100.4361 16.4387 9.0692 4.7503 0.8302 1.4559 14.3219 1.6796 16.2426 0.2778 18.6142 3.4056 7.3312 5.7119 9.6544 0.3956 3.7194 15.4304 16.1526 3.5834 13.6301 2.9625 7.7746 13.8227 23.1595 1.9729 3.9168 47.5182 94.8563 32.4421 36.9752 30.1618 30.3129 63.3479 57.3079 54.9506 47.8265 65.1225 31.1179 10.9089
temp: 298.150 k
press: 1.00000 atm
elementType: 8 8 6 6 6 6 6 6 6 1 1 1 1 1 1 1 1 1 1 1 1 1 1
symmnumber: 1
zpe: 531386.7 jmol-1
zpe.correction: 0.202394 hartree
zpe.thermalcorrener: 0.212014 hartree
zpe.thermalcorrenthalpy: 0.212959 hartree
zpe.thermalcorrgfe: 0.168100 hartree
zpe.sumelectzpe: -424.823370 hartree
zpe.sumelectthermal: -424.813750 hartree
zpe.sumelectthermalent: -424.812805 hartree
zpe.sumelectthermalfe: -424.857664 hartree
dipole: 0.5210 -2.9639 0.4613
dipole: 3.0445
quadrupole: -49.6535 -61.6039 -56.1839
quadrupole: -0.2741 2.3298 -1.7111
quadrupole: 6.1602 -5.7901 -0.3702 -0.2741 2.3298 -1.7111
hfenergy: -425.025764 hartree
pointgroup: C01 [X(C7H14O2)]
dipole: 0.2744975 -1.1505323 0.1887021 debye
dipolederiv: -1.1594591 0.075871 -0.0872289 0.0967363 -0.5057146 -0.015073 -0.0072046 0.0108522 -0.4054822 -0.3992465 -0.1714148 -0.13647 -0.1917967 -0.8632034 0.030195 -0.1475043 0.021487 -0.487482 0.7363915 0.0881425 -0.0280262 0.1350479 0.184508 0.0608184 -0.1317897 0.0862439 0.30517 0.2926012 0.143905 0.0738306 0.1757562 0.5559276 0.0433468 0.0766816 -0.0027472 0.3917505 -0.1039355 -0.0094413 0.0266177 -0.1223374 -0.0422247 -0.0292174 0.034932 -0.0122208 0.1062993 -0.0108059 -0.0770656 0.0168264 0.0068573 0.0100229 -0.0105445 -0.0035535 0.0181745 0.1216004 0.0843697 0.0301011 0.0003072 -0.0114853 0.0662007 0.0215684 -0.0398287 -0.0213154 0.1540737 0.067371 0.0015276 -0.0155359 0.0153145 0.0536563 0.002363 0.0295001 0.0170875 0.1552222 0.5660942 -0.1147276 0.0925074 -0.2267825 0.328385 0.0080064 0.2401314 -0.0087892 0.3411423 -0.0365676 -0.0027225 -0.0204146 -0.033722 0.0230272 -0.0161277 0.0350354 -0.0129637 -0.2038992 0.0167121 -0.0116321 0.0108699 -0.0153012 -0.0263946 -0.057267 -0.0225327 -0.047291 -0.2154948 -0.0506475 0.1330988 -0.0364134 0.1183943 -0.0962494 0.0404573 -0.0613416 0.0568693 0.0511935 0.059339 -0.0256735 0.0013678 -0.0205655 0.0633559 0.0254406 0.0175937 -0.0363659 -0.1561795 -0.0360532 0.1034551 -0.0391265 0.1166344 -0.0817706 0.0456083 -0.0459904 0.0691444 0.0610632 0.0557449 -0.0285765 -0.0272341 -0.0220022 0.0691735 0.0022321 0.0244215 -0.0374622 -0.1629247 0.0278987 0.0243096 -0.0157229 0.0292175 0.0774624 -0.0196836 0.0173201 0.0474172 -0.1918063 -0.014841 -0.0832153 -0.0175426 -0.0953579 -0.1793017 -0.0465592 -0.0276309 -0.0775262 0.0645015 0.0876973 0.0126087 0.0086861 0.0076041 0.0188136 -0.0046127 -0.0662462 -0.01804 -0.1904945 -0.2060238 -0.032659 0.0632934 -0.0305615 0.0384215 0.0089944 0.0997782 0.0144985 0.055899 0.100543 -0.0276045 0.070055 -0.0075104 0.4036376 -0.0585573 0.0725977 -0.0534031 0.2981698 -0.1416262 -0.044223 0.0525659 -0.0822255 0.0657771 0.0395239 0.0743289 0.0383993 0.0745287 0.0352422 -0.0127847 -0.0278928 0.1002704 -0.2132543 -0.0356193 -0.0595678 -0.0399669 0.0468934 0.0292015 0.0287208 0.0346807 0.0578153 0.0497439 -0.0352929 -0.10913 -0.0120824 -0.2137443 unknown
polarizability: 93.516228|0.8002189|79.8310483|0.5598736|0.5444216|65.9973314 unknown
InChI: InChI=1S/C7H14O2/c1-9-7-5-3-2-4-6(7)8/h6-8H,2-5H2,1H3
charge 0 multiplicity 1
23 atoms
O  1.922804 0.174323 -0.376323
O  0.183209 2.293459 0.145195
C  0.587038 -0.141645 0.179136
C  -0.318987 0.997223 -0.322528
C  0.048677 -1.516926 -0.262981
C  -1.756256 0.823753 0.186701
C  -1.405009 -1.710009 0.242006
C  -2.324249 -0.555307 -0.228908
C  3.02192 -0.551875 0.258493
H  0.642283 -0.089206 1.291694
H  -0.305012 0.963125 -1.436109
H  0.696484 -2.329496 0.117718
H  0.074138 -1.566968 -1.369795
H  -2.379167 1.646556 -0.20877
H  -1.752816 0.921507 1.29038
H  -1.407454 -1.748701 1.351027
H  -1.796677 -2.68259 -0.111945
H  -2.424337 -0.597047 -1.332993
H  -3.340806 -0.684506 0.188431
H  1.156687 2.29647 -0.056752
H  3.949678 -0.132027 -0.162115
H  2.983434 -1.637268 0.036638
H  3.017217 -0.407643 1.359801
