program: Gaussian 09
title: 000102928
version: EM64L-G09RevD.01
frameworkgroup: C1[X(C16H14O3)]
method: RPBEPBE
basis: SDD
operation: Freq
keyword: #pfreq=noraman
keyword: PBEPBE/SDD
title: #p freq=noraman PBEPBE/SDD
converged: YES YES NO NO
title: Mulliken charges:
elementType: O O O C C C C C C C C C C C C C C C C H H H H H H H H H H H H H H
charge: -0.276227 -0.212935 -0.263402 -0.220862 -0.540227 0.507663 0.086990 0.182743 0.229634 -0.434355 -0.375455 -0.360771 -0.374403 -0.350414 -0.356839 0.319338 -0.249649 -0.199006 -0.538010 0.238110 0.261938 0.255054 0.235345 0.248746 0.275661 0.257548 0.252740 0.240935 0.235083 0.233547 0.222045 0.247063 0.222370
chargesum: 0.00000
title: Mulliken charges with hydrogens summed into heavy atoms:
elementType: O O O C C C C C C C C C C C C C C C C
charge: -0.276227 -0.212935 -0.263402 0.017248 -0.023235 0.507663 0.086990 0.182743 0.229634 -0.199010 -0.126708 -0.085110 -0.116855 -0.097673 -0.115904 0.319338 -0.014567 0.034541 0.153469
polarizability: 2.77788468e+02 -4.29636824e+00 1.66933203e+02 1.58816248e+00 6.40539659e+00 1.14032693e+02
1716.lowfreq: -4.6060 -1.1935 -0.0003 0.0005 0.0009 8.9513 23.6109 41.7990 44.6664
frequency: 23.4114 41.7974 44.6556 97.5895 103.6893 137.8558 153.8900 174.2664 221.9541 233.1528 242.7265 279.8957 288.7231 366.0747 400.6993 412.5238 429.6364 443.5716 474.2650 508.3320 521.5516 529.0280 550.7096 574.0433 598.3926 626.2475 649.2177 704.1006 731.7481 744.6686 760.9592 775.2103 808.7494 817.5648 835.1795 839.8500 876.4048 886.4953 944.4867 960.9139 963.2318 974.6855 987.5045 996.5776 1003.0146 1021.5965 1039.9462 1058.9231 1108.2078 1112.0988 1112.4001 1155.0757 1157.7688 1170.1922 1177.6146 1204.5539 1219.9343 1228.9057 1234.6171 1256.5299 1297.5273 1303.2155 1316.1417 1341.1121 1389.6713 1394.9269 1420.8283 1424.4351 1436.3082 1447.6363 1458.5897 1466.5457 1472.9386 1505.4249 1570.9245 1586.6442 1593.1395 1620.9170 1626.1058 2960.6532 2970.5883 2991.5138 3048.8652 3082.0190 3123.9589 3126.6934 3135.6981 3141.5075 3147.2820 3163.6326 3164.9032 3169.9589 3174.3384
redmass: 3.8987 4.9758 5.2080 4.4307 3.8415 3.7197 4.8613 3.1868 5.8048 1.3915 3.5397 5.8936 4.0435 5.9751 3.2688 2.9478 5.7016 3.8347 5.6353 3.5116 4.1987 3.8025 2.8305 3.6908 5.8601 6.0359 4.6757 5.2118 3.8074 3.9697 4.6701 1.3053 3.6838 1.3649 2.3897 2.5721 1.6359 3.1129 1.3771 2.3451 1.4495 1.4982 8.6106 1.3501 2.6461 2.6461 3.7109 3.0323 1.6896 1.3853 1.2600 1.3547 1.2705 1.1683 1.2265 2.3528 1.8504 1.8934 3.4346 1.4572 2.1601 1.3431 1.2390 2.2555 6.4526 4.6843 3.1163 1.0905 1.1757 2.6843 2.5256 1.0503 1.0730 2.5870 7.1628 7.1683 9.0795 7.4261 6.5154 1.0330 1.0831 1.0667 1.1040 1.0959 1.0899 1.0993 1.0860 1.0880 1.0901 1.0951 1.0950 1.0953 1.0997
irintensity: 1.2082 0.5043 0.1415 3.4012 9.3499 1.8868 2.3229 3.4070 0.1884 0.5638 2.5827 4.5086 0.1700 2.2739 2.4430 1.5891 0.3763 5.2536 0.3258 16.2222 8.8094 23.1777 5.5809 18.0574 6.4012 0.2007 5.9123 3.2980 0.2250 0.6588 5.5030 90.8421 24.8122 4.1576 12.9231 48.4777 14.7496 71.5709 0.7743 19.0243 2.0961 4.0647 41.9128 0.1539 6.2838 37.5200 28.8081 6.4801 59.3759 16.7901 0.3915 4.8926 26.7314 3.5201 100.7190 116.4282 9.7099 66.8934 151.5310 2.7097 174.5474 17.6745 6.4919 84.9966 3.7919 24.7221 12.9239 11.2522 8.4362 109.6520 35.3703 13.7289 54.3082 102.3302 18.3581 14.3215 252.0637 150.0896 33.1458 66.8114 18.0419 10.6022 47.3498 6.8522 13.1311 27.0318 4.4257 9.7533 3.3072 15.9490 12.1322 4.4613 18.9466
temp: 298.150 k
press: 1.00000 atm
elementType: 8 8 8 6 6 6 6 6 6 6 6 6 6 6 6 6 6 6 6 1 1 1 1 1 1 1 1 1 1 1 1 1 1
symmnumber: 1
zpe: 676322.3 jmol-1
zpe.correction: 0.257598 hartree
zpe.thermalcorrener: 0.273596 hartree
zpe.thermalcorrenthalpy: 0.274540 hartree
zpe.thermalcorrgfe: 0.212839 hartree
zpe.sumelectzpe: -842.418449 hartree
zpe.sumelectthermal: -842.402451 hartree
zpe.sumelectthermalent: -842.401507 hartree
zpe.sumelectthermalfe: -842.463207 hartree
dipole: -2.1155 -3.1266 -0.7045
dipole: 3.8402
quadrupole: -95.1598 -115.1596 -107.4769
quadrupole: -6.8328 10.4399 6.6027
quadrupole: 10.7722 -9.2275 -1.5448 -6.8328 10.4399 6.6027
hfenergy: -842.6760463 hartree
pointgroup: C01 [X(C16H14O3)]
dipole: -0.8185397 -1.0904213 -0.6508516 debye
polarizability: 277.7665828|-4.5704284|158.3371022|2.7097829|20.4455074|122.6506792 unknown
InChI: InChI=1S/C16H14O3/c1-18-12-8-6-11(7-9-12)16-10-14(17)13-4-2-3-5-15(13)19-16/h2-9,16H,10H2,1H3
charge 0 multiplicity 1
33 atoms
O  0.825981 -0.859574 -0.029087
O  2.799041 2.84451 0.279216
O  -5.550489 -0.14488 0.02117
C  0.149787 0.323359 0.60553
C  0.696125 1.625356 -0.018028
C  -1.341447 0.143623 0.428285
C  2.216438 1.730083 0.134799
C  2.943164 0.43803 0.038176
C  2.221785 -0.787486 -0.09434
C  -2.226076 0.415406 1.50309
C  -1.885655 -0.24696 -0.817177
C  4.363937 0.407907 -0.012526
C  2.908841 -2.005818 -0.308684
C  -3.619026 0.317167 1.336648
C  -3.280705 -0.363476 -0.999073
C  -4.151565 -0.072238 0.081991
C  5.051882 -0.800067 -0.209912
C  4.315384 -2.006346 -0.367044
C  -6.15511 -0.547037 -1.251324
H  0.413401 0.297483 1.683949
H  0.217553 2.505568 0.443873
H  0.446793 1.64339 -1.098685
H  -1.823133 0.706619 2.480951
H  -1.210947 -0.490527 -1.644999
H  4.892904 1.361677 0.090523
H  2.329459 -2.928398 -0.408931
H  -4.310361 0.526304 2.158277
H  -3.672187 -0.680261 -1.970263
H  6.145555 -0.815344 -0.250229
H  4.845005 -2.952317 -0.52624
H  -5.900577 0.164443 -2.060885
H  -7.239789 -0.530537 -1.070945
H  -5.84087 -1.568458 -1.541804
