program: Gaussian 09
title: 000102926
version: EM64L-G09RevD.01
frameworkgroup: C1[X(C7H14O7)]
method: RPBEPBE
basis: SDD
operation: Freq
keyword: #pfreq=noraman
keyword: PBEPBE/SDD
title: #p freq=noraman PBEPBE/SDD
converged: YES YES NO NO
title: Mulliken charges:
elementType: O O O O O O O C C C C C C C H H H H H H H H H H H H H H
charge: -0.479908 -0.421894 -0.482912 -0.501531 -0.445429 -0.247845 -0.436715 -0.133011 -0.120795 -0.100071 -0.250899 -0.317746 0.156395 -0.365344 0.225119 0.252151 0.216611 0.279014 0.192405 0.237994 0.394731 0.349202 0.372292 0.390691 0.240688 0.267813 0.360298 0.368696
chargesum: 0.00000
title: Mulliken charges with hydrogens summed into heavy atoms:
elementType: O O O O O O O C C C C C C C
charge: -0.085177 -0.072692 -0.110620 -0.110840 -0.085131 -0.247845 -0.068019 0.092108 0.131356 0.116541 0.028115 0.112652 0.156395 0.143157
polarizability: 1.25588129e+02 -1.08112299e+00 9.77284369e+01 5.68426923e+00 4.06403604e+00 8.02510113e+01
1716.lowfreq: -0.0006 0.0003 0.0010 6.2251 10.2941 13.6017 37.7399 47.8739 65.2442
frequency: 37.6558 47.8699 65.2159 86.2024 89.1578 105.0603 121.7533 151.7125 192.5770 196.2673 235.2647 261.2442 293.2037 309.1745 333.4919 354.0097 387.3016 402.1266 427.7586 444.1012 471.1958 489.9488 494.4901 526.3392 547.0535 576.8012 637.6307 692.6971 746.5282 800.4912 856.7358 894.4409 939.3070 945.4509 982.7302 1001.3077 1006.9206 1036.0323 1044.3934 1054.4319 1067.4114 1084.2683 1144.5643 1159.4370 1180.1916 1196.5452 1207.7445 1238.8110 1247.6622 1260.8426 1270.1122 1313.1894 1317.7883 1323.5141 1338.4771 1348.8395 1362.8106 1370.9464 1381.6267 1383.8858 1396.6388 1444.8122 1458.4216 1595.5089 2936.7826 2949.5167 2964.3112 2968.2563 2978.0513 3023.3049 3042.7097 3096.9365 3418.6990 3478.0229 3484.8855 3531.0165 3532.7544 3535.1322
redmass: 6.2738 6.0451 6.0381 6.9463 4.4455 3.3605 3.8372 5.5007 4.4772 5.3259 4.4458 4.4055 4.4922 1.9440 3.6467 2.0216 3.1280 1.5156 2.4803 3.0745 4.6377 1.2013 1.1296 1.3079 2.7623 3.7256 1.1220 3.8989 3.4684 4.6516 2.3251 3.1311 3.7075 5.7202 3.1088 3.9918 4.7452 2.3376 2.4972 3.1693 3.5148 2.8679 1.6477 1.1939 1.4029 1.3200 1.1905 1.2477 1.1253 1.1937 1.4199 1.2998 1.3108 1.2069 1.2484 1.4792 1.2780 1.2766 1.4166 1.4488 1.4009 1.0765 1.0916 8.4629 1.0670 1.0810 1.0737 1.0813 1.0820 1.0911 1.0864 1.0946 1.0645 1.0659 1.0650 1.0649 1.0652 1.0655
irintensity: 0.4519 0.3818 3.1732 4.0741 0.6983 8.2626 22.1922 2.0797 0.9244 1.4644 4.7661 38.0341 8.3643 113.9599 12.3038 47.3472 18.5188 80.9021 36.9030 4.8443 12.8036 241.7746 98.8362 126.0390 9.0695 35.0154 222.9035 16.9480 36.7103 33.6679 22.0696 12.8127 48.1607 65.1428 104.3410 126.8520 106.7274 47.1602 29.4441 60.8073 27.0208 22.5037 13.6262 29.3579 29.3599 33.1269 3.1793 33.0789 42.3322 93.8963 57.6213 4.8611 18.4551 80.2607 2.2011 65.9561 23.3577 42.5570 67.1498 13.4517 15.6741 11.8913 4.7523 83.4062 30.1563 11.4710 21.5355 8.5803 97.2504 13.9289 26.4385 23.2970 68.0300 54.1064 17.9469 26.1384 16.3267 10.2983
temp: 298.150 k
press: 1.00000 atm
elementType: 8 8 8 8 8 8 8 6 6 6 6 6 6 6 1 1 1 1 1 1 1 1 1 1 1 1 1 1
symmnumber: 1
zpe: 576124.6 jmol-1
zpe.correction: 0.219434 hartree
zpe.thermalcorrener: 0.235648 hartree
zpe.thermalcorrenthalpy: 0.236592 hartree
zpe.thermalcorrgfe: 0.175378 hartree
zpe.sumelectzpe: -800.510711 hartree
zpe.sumelectthermal: -800.494498 hartree
zpe.sumelectthermalent: -800.493554 hartree
zpe.sumelectthermalfe: -800.554768 hartree
dipole: 1.8823 3.2668 0.2967
dipole: 3.7819
quadrupole: -106.0625 -92.2643 -80.2349
quadrupole: -1.9961 1.7173 0.7986
quadrupole: -13.2086 0.5896 12.6190 -1.9961 1.7173 0.7986
hfenergy: -800.7301455 hartree
pointgroup: C01 [X(C7H14O7)]
dipole: -0.6029648 1.2621755 0.5071912 debye
polarizability: 126.0266952|-2.7862198|98.057024|0.4696188|3.9927367|79.4838574 unknown
InChI: InChI=1S/C7H14O7/c8-1-3(10)5(12)7(14)6(13)4(11)2-9/h3,5-10,12-14H,1-2H2
charge 0 multiplicity 1
28 atoms
O  1.502797 1.157326 1.2902
O  -0.408154 -0.308463 -1.568255
O  3.799051 0.15191 0.257555
O  -0.963939 1.937283 0.391724
O  3.895503 -2.180411 -1.251278
O  -3.395076 0.908952 0.120313
O  -4.292737 -1.658253 0.379593
C  1.375137 0.446282 0.005071
C  -0.018964 -0.238815 -0.155851
C  2.539149 -0.559115 -0.004733
C  -1.084255 0.505481 0.681945
C  2.756199 -1.268793 -1.348105
C  -2.511698 0.042631 0.389407
C  -2.8642 -1.433716 0.413382
H  1.497924 1.170206 -0.829413
H  0.022157 -1.294246 0.1694
H  2.36631 -1.313795 0.794305
H  -0.873455 0.326934 1.758054
H  2.920777 -0.504708 -2.137484
H  1.887708 -1.886381 -1.624725
H  0.893695 1.945095 1.254885
H  -0.468834 0.619186 -1.917485
H  3.636924 0.746543 1.036662
H  -1.889019 2.30314 0.290352
H  -2.457177 -1.914639 1.323639
H  -2.363795 -1.896942 -0.467285
H  4.642023 -1.659944 -0.852912
H  -4.727951 -0.827748 0.042835
