program: Gaussian 09
title: 000102916
version: EM64L-G09RevD.01
frameworkgroup: C1[X(C10H20O2)]
method: RPBEPBE
basis: SDD
operation: Freq
keyword: #pfreq=noraman
keyword: PBEPBE/SDD
title: #p freq=noraman PBEPBE/SDD
converged: YES YES NO NO
title: Mulliken charges:
elementType: O O C C C C C C C C C C H H H H H H H H H H H H H H H H H H H H
charge: -0.268601 -0.248916 -0.130875 -0.419711 -0.350774 -0.398956 -0.354397 0.210260 -0.703599 -0.698432 -0.228999 -0.673846 0.225613 0.217217 0.196539 0.188810 0.203797 0.203342 0.223428 0.192594 0.199716 0.211815 0.216315 0.227874 0.211163 0.209728 0.216096 0.226589 0.226611 0.210515 0.229420 0.229664
chargesum: 0.00000
title: Mulliken charges with hydrogens summed into heavy atoms:
elementType: O O C C C C C C C C C C
charge: -0.268601 -0.248916 0.094738 -0.005955 0.041832 0.027814 0.037913 0.210260 -0.047595 -0.061444 0.224201 -0.004246
polarizability: 1.24136494e+02 -2.41392777e+00 1.22823549e+02 1.05835691e+00 -1.38524152e+00 9.90557516e+01
1716.lowfreq: -11.0162 -3.1962 0.0006 0.0009 0.0010 7.6349 14.6915 42.6094 52.4685
frequency: 13.0164 42.5632 52.3940 55.7812 74.9348 94.4155 113.3291 135.9077 149.0040 181.6681 219.2371 229.3461 237.4811 260.7318 288.9303 295.7484 340.7676 407.2613 427.4197 497.0748 633.5358 707.3019 729.6816 779.6367 786.7435 798.5886 820.2301 851.7489 890.7391 915.9491 944.3929 990.6312 1022.5493 1035.2500 1050.0682 1073.9835 1083.4109 1099.4692 1104.8879 1114.7189 1124.5531 1135.0815 1148.3923 1209.7068 1240.6647 1247.3300 1259.9728 1274.2111 1290.7104 1293.2285 1329.2906 1332.7139 1342.1476 1356.0379 1368.3012 1389.2768 1393.5625 1400.4589 1455.2086 1463.1238 1463.7754 1466.0892 1473.7561 1475.7922 1477.2502 1478.1040 1481.5320 1486.3381 1486.8979 1631.1771 2958.3318 2966.0385 2972.5452 2974.5646 2976.7741 2984.8146 2995.0061 2996.9645 3008.6250 3012.8126 3022.3788 3038.7224 3048.8551 3066.2745 3069.3817 3071.4171 3075.5435 3075.8321 3091.3990 3106.3692
redmass: 3.6389 2.0111 3.0399 1.9607 2.9092 2.7850 2.2800 2.1173 2.6955 1.9357 1.7707 1.4184 1.2472 1.6242 3.0099 3.5814 3.3634 3.2431 3.0376 3.3735 2.5850 2.5615 1.2480 1.3879 2.0042 1.1075 2.3763 2.1403 2.0029 1.4997 1.5738 3.7042 2.2988 1.4811 3.1526 2.2238 2.0523 2.1575 2.6140 2.2462 2.2588 1.4705 2.5720 1.4739 1.2740 1.1399 1.2261 1.2442 1.1968 1.0976 1.4307 1.3480 1.3390 1.5708 1.5540 1.2157 1.2133 1.2706 1.0756 1.0752 1.0423 1.0783 1.0587 1.0681 1.0433 1.0502 1.0506 1.0782 1.0703 8.9930 1.0586 1.0596 1.0360 1.0592 1.0359 1.0601 1.0359 1.0977 1.0585 1.0886 1.0993 1.1021 1.1007 1.1065 1.1006 1.0993 1.1005 1.0997 1.0985 1.1025
irintensity: 0.8709 0.0284 1.2058 0.0461 0.2942 0.3521 0.1930 1.5683 2.2100 2.5319 0.5296 0.8789 0.1533 2.3780 6.4137 1.2693 6.3355 2.3138 1.8228 2.5406 0.1321 3.7001 9.5692 9.2875 5.4676 3.1020 0.3928 5.8705 4.1782 6.7155 17.3137 1.8890 48.8708 3.3334 5.2665 18.3407 15.4655 96.0330 88.4241 30.3839 52.7820 5.6828 61.1475 5.1693 4.1665 0.0195 7.7833 6.8158 0.7455 1.0567 2.1463 4.6966 18.4474 2.7082 14.9457 9.5915 13.7003 20.4392 0.2211 4.5786 10.1260 8.2979 4.0558 6.1349 10.0400 13.2227 13.0863 17.8720 13.2218 135.8745 1.5133 23.9941 40.6334 53.7585 38.0043 47.9673 21.4760 0.2895 17.6982 9.0375 8.8904 5.9686 42.1289 9.5634 80.3268 54.1557 68.5171 54.1965 31.4335 44.1830
temp: 298.150 k
press: 1.00000 atm
elementType: 8 8 6 6 6 6 6 6 6 6 6 6 1 1 1 1 1 1 1 1 1 1 1 1 1 1 1 1 1 1 1 1
symmnumber: 1
zpe: 741911.2 jmol-1
zpe.correction: 0.282579 hartree
zpe.thermalcorrener: 0.298479 hartree
zpe.thermalcorrenthalpy: 0.299424 hartree
zpe.thermalcorrgfe: 0.236933 hartree
zpe.sumelectzpe: -542.522668 hartree
zpe.sumelectthermal: -542.506767 hartree
zpe.sumelectthermalent: -542.505823 hartree
zpe.sumelectthermalfe: -542.568314 hartree
dipole: -0.0951 0.6462 -1.6237
dipole: 1.7501
quadrupole: -72.2369 -69.1481 -81.4867
quadrupole: -4.0498 1.0333 2.3274
quadrupole: 2.0536 5.1425 -7.1961 -4.0498 1.0333 2.3274
hfenergy: -542.8052467 hartree
pointgroup: C01 [X(C10H20O2)]
dipole: 0.0454135 -0.2549131 -0.6380099 debye
polarizability: 124.2854066|-2.3722262|122.6832008|-1.0879423|1.27865|99.0471874 unknown
InChI: InChI=1S/C10H20O2/c1-4-7-8-9(5-2)10(11)12-6-3/h9H,4-8H2,1-3H3
charge 0 multiplicity 1
32 atoms
O  1.438483 -0.909752 -0.339386
O  1.02502 0.119435 1.70841
C  0.164474 1.149364 -0.371474
C  -1.342452 1.149663 0.016511
C  -2.070834 -0.17956 -0.281024
C  0.804381 2.547868 -0.142987
C  -3.574533 -0.128933 0.073498
C  0.901229 0.104523 0.460041
C  2.273075 2.64285 -0.607427
C  -4.305886 -1.456785 -0.218612
C  2.172672 -1.996515 0.382441
C  2.635443 -2.992826 -0.675705
H  0.268878 0.867039 -1.436277
H  -1.428527 1.389808 1.095024
H  -1.837487 1.97175 -0.539209
H  -1.953794 -0.435409 -1.354581
H  -1.594033 -1.003287 0.288902
H  0.192552 3.2935 -0.687964
H  0.733343 2.794145 0.934051
H  -4.056415 0.693049 -0.494901
H  -3.686074 0.12812 1.146624
H  2.371596 2.389272 -1.679648
H  2.66672 3.665226 -0.462004
H  2.920674 1.952302 -0.03627
H  -3.864555 -2.287965 0.363217
H  -4.233148 -1.722453 -1.290204
H  -5.378413 -1.394466 0.042351
H  3.014325 -1.539304 0.933872
H  1.486327 -2.448336 1.121486
H  3.189955 -3.820131 -0.196066
H  1.774311 -3.419783 -1.217747
H  3.301492 -2.507407 -1.409441
