program: Gaussian 09
title: 000102914
version: EM64L-G09RevD.01
frameworkgroup: C1[X(C11H20O2)]
method: RPBEPBE
basis: SDD
operation: Freq
keyword: #pfreq=noraman
keyword: PBEPBE/SDD
title: #p freq=noraman PBEPBE/SDD
converged: YES YES NO NO
title: Mulliken charges:
elementType: O O C C C C C C C C C C C H H H H H H H H H H H H H H H H H H H H
charge: -0.207274 -0.210346 -0.212500 -0.435909 -0.373246 -0.477213 -0.383283 -0.372429 -0.311800 0.186004 -0.354128 -0.356195 -0.695799 0.256063 0.238558 0.209178 0.204182 0.191483 0.231949 0.241194 0.197940 0.194458 0.190759 0.187944 0.220171 0.235389 0.188626 0.190447 0.195381 0.194031 0.210704 0.209991 0.215671
chargesum: 0.00000
title: Mulliken charges with hydrogens summed into heavy atoms:
elementType: O O C C C C C C C C C C C
charge: -0.207274 -0.210346 0.043564 0.011828 0.022419 -0.004071 0.009115 0.006273 0.143759 0.186004 0.024946 0.033218 -0.059433
polarizability: 1.52180236e+02 -4.33237556e+00 1.18932301e+02 -9.49709411e-01 -4.59204253e-02 9.63671148e+01
1716.lowfreq: -21.8226 -6.3884 0.0004 0.0007 0.0010 5.9087 27.3285 40.0154 44.9896
frequency: 27.0959 39.5581 44.7535 71.2675 93.9030 103.9658 126.1618 142.6177 149.8133 180.8065 188.3475 228.8492 237.3378 333.7655 368.2220 414.0715 459.5178 508.1621 574.0680 638.3067 658.6170 720.7852 728.7434 755.2315 788.7354 812.4760 855.9390 888.5494 895.5306 918.0408 934.8075 981.1333 996.3050 1003.9926 1023.7349 1036.4465 1051.5501 1074.7437 1081.1817 1086.8172 1110.2601 1130.5060 1142.5168 1172.6956 1188.4682 1197.8793 1217.2042 1233.5122 1252.3375 1266.4439 1280.0573 1282.0153 1289.0121 1294.5023 1301.4380 1313.5119 1323.4425 1341.2595 1348.1487 1355.9055 1359.7591 1390.1143 1460.1203 1461.7149 1464.0443 1466.0364 1470.2961 1476.8696 1477.1836 1483.0219 1484.2595 1488.7519 1701.7177 2949.8472 2951.9906 2954.4935 2960.5617 2962.1627 2968.0463 2972.2710 2979.0317 2984.7914 2992.4359 3003.7047 3012.9911 3018.0993 3021.7711 3036.5657 3048.9719 3068.7789 3070.9720 3086.9253 3109.3670
redmass: 3.9563 1.7073 4.1590 3.3536 2.0262 2.3186 3.0292 2.0757 2.3619 4.9939 2.6142 1.1198 3.3093 3.4314 2.5720 3.3299 3.2688 4.7474 3.8056 3.5309 5.7495 1.0625 1.0967 1.1857 3.8020 1.2916 1.5601 1.9264 2.1318 1.6170 2.9621 1.3493 3.3369 2.7725 2.3882 1.4960 3.0518 2.5121 2.4381 2.9411 2.1749 2.7215 1.5954 1.5259 1.5154 1.4005 1.3014 1.3799 1.2838 1.2898 1.2658 1.0900 1.2069 1.0824 1.1799 1.3170 1.4034 1.3992 1.5066 1.6722 1.6166 1.2176 1.0750 1.0726 1.0725 1.0844 1.0805 1.0426 1.0784 1.0883 1.0864 1.0921 12.7474 1.0588 1.0587 1.0591 1.0777 1.0616 1.0590 1.0364 1.0632 1.0962 1.0981 1.1014 1.0629 1.0642 1.1038 1.1041 1.1028 1.1006 1.0993 1.1008 1.1059
irintensity: 1.1808 0.7978 1.9732 0.5216 0.5750 0.5678 1.7667 0.8455 0.2611 1.4676 2.4093 0.0010 2.3363 2.8249 0.9038 1.1100 0.5241 1.4928 4.4151 5.6636 2.9040 13.9215 0.0590 2.8185 2.7554 1.0642 5.2620 8.4363 34.5172 11.0196 43.5165 6.4078 6.9802 21.2407 7.5081 1.6050 0.7306 52.7895 8.5173 117.4361 5.3234 3.9241 30.7870 6.1125 10.2901 3.0474 9.6403 0.5396 2.4007 1.2343 0.7112 0.8682 1.2382 0.4634 0.3082 3.4616 0.5333 3.6758 0.1793 0.6287 1.1835 11.1482 0.9502 0.3684 2.4839 4.8110 3.6541 12.4138 1.6957 4.5323 1.1843 27.1451 270.4224 0.0730 6.6859 0.3396 7.4393 16.6594 133.1558 36.7230 49.4695 1.8422 1.1551 0.8583 20.9366 49.0392 0.2184 59.7737 112.4792 95.0572 53.6707 20.1618 30.1734
temp: 298.150 k
press: 1.00000 atm
elementType: 8 8 6 6 6 6 6 6 6 6 6 6 6 1 1 1 1 1 1 1 1 1 1 1 1 1 1 1 1 1 1 1 1
symmnumber: 1
zpe: 763233.9 jmol-1
zpe.correction: 0.290700 hartree
zpe.thermalcorrener: 0.305873 hartree
zpe.thermalcorrenthalpy: 0.306817 hartree
zpe.thermalcorrgfe: 0.246160 hartree
zpe.sumelectzpe: -580.565536 hartree
zpe.sumelectthermal: -580.550363 hartree
zpe.sumelectthermalent: -580.549419 hartree
zpe.sumelectthermalfe: -580.610077 hartree
dipole: -2.6984 -4.5128 0.5461
dipole: 5.2863
quadrupole: -99.0574 -85.2540 -78.8083
quadrupole: -19.0022 2.0343 0.8364
quadrupole: -11.3509 2.4526 8.8983 -19.0022 2.0343 0.8364
hfenergy: -580.8562365 hartree
pointgroup: C01 [X(C11H20O2)]
dipole: 1.0822678 -1.7698243 -0.1480684 debye
polarizability: 152.096591|4.6668717|119.0092475|-0.619574|-0.6600595|96.3738133 unknown
InChI: InChI=1S/C11H20O2/c1-2-3-4-5-6-7-10-8-9-13-11(10)12/h10H,2-9H2,1H3
charge 0 multiplicity 1
33 atoms
O  -4.564556 -0.069398 0.212947
O  -3.582705 1.997698 -0.187857
C  -2.234407 -0.105903 -0.433438
C  -0.931241 0.554031 0.063657
C  0.336958 -0.219616 -0.358359
C  -2.593389 -1.472344 0.20175
C  1.640425 0.444687 0.138752
C  2.913261 -0.320851 -0.288232
C  -4.137189 -1.501269 0.132127
C  -3.474498 0.762601 -0.142574
C  4.21941 0.325924 0.224928
C  5.490686 -0.441041 -0.205949
C  6.791554 0.203285 0.319756
H  -2.178695 -0.210746 -1.538566
H  -0.890644 1.588355 -0.329378
H  -0.96804 0.640174 1.168716
H  0.290695 -1.258831 0.028716
H  0.366495 -0.299401 -1.465656
H  -2.254975 -1.490152 1.254213
H  -2.142331 -2.331556 -0.320613
H  1.691095 1.485071 -0.244053
H  1.613054 0.522558 1.245689
H  2.947564 -0.385668 -1.396091
H  2.853692 -1.366121 0.082096
H  -4.510124 -1.90642 -0.826187
H  -4.620898 -2.023681 0.971403
H  4.188328 0.387789 1.332991
H  4.281785 1.371758 -0.142198
H  5.524904 -0.49564 -1.313359
H  5.423302 -1.488111 0.154465
H  6.899012 1.239884 -0.051923
H  6.795495 0.242637 1.42549
H  7.684278 -0.364504 -0.00126
