program: Gaussian 09
title: 000102958
version: EM64L-G09RevD.01
frameworkgroup: C1[X(C13H16N2O5)]
method: RPBEPBE
basis: SDD
operation: Freq
keyword: #p
keyword: freq=noraman
keyword: PBEPBE/SDD
title: #p freq=noraman PBEPBE/SDD
converged: YES YES NO NO
title: Mulliken charges:
elementType: O O O O O N N C C C C C C C C C C C C C H H H H H H H H H H H H H H H H
charge: -0.278612 -0.267118 -0.348627 -0.404735 -0.233992 -0.366060 -0.367212 -0.212230 -0.723442 0.268305 -0.479428 0.472534 0.350976 -0.442444 -0.390651 -0.365432 -0.224421 -0.227263 -0.231826 0.205679 0.270109 0.237117 0.242998 0.224409 0.334329 0.363399 0.244441 0.222347 0.287311 0.263733 0.232898 0.271635 0.228635 0.229113 0.230942 0.382584
chargesum: 0.00000
title: Mulliken charges with hydrogens summed into heavy atoms:
elementType: O O O O O N N C C C C C C C C C C C C C
charge: -0.278612 -0.267118 -0.348627 -0.022151 -0.233992 -0.031731 -0.003814 0.057879 -0.018918 0.268305 -0.012640 0.472534 0.350976 0.108600 -0.157753 -0.093797 0.004214 0.001850 -0.000884 0.205679
polarizability: 2.12394317e+02 3.10975489e+00 1.45143179e+02 -5.87304095e+00 1.91935364e+00 1.46522917e+02
1716.lowfreq: -0.0006 -0.0006 -0.0004 2.7023 5.1704 8.5162 19.0595 20.1888 32.5418
frequency: 19.0371 20.0970 32.4693 33.1333 37.4473 41.6126 69.0147 88.3625 123.8633 140.0531 158.7889 193.2004 202.9690 236.0114 253.1198 282.6795 292.7737 314.8918 335.3601 369.0748 404.3711 408.0683 448.0895 481.3864 508.2478 530.2691 552.5119 584.4219 596.4542 617.0848 621.6578 657.4349 662.8069 695.5063 704.9538 745.1447 758.7686 790.4508 809.3524 815.9725 845.0560 858.0624 862.3268 900.8374 935.3840 972.4499 982.6936 989.9991 1000.4749 1001.5687 1015.9953 1027.2842 1047.4454 1071.5909 1082.0625 1091.3920 1139.9555 1156.8303 1173.9025 1189.1283 1219.1436 1222.0010 1239.0112 1242.2040 1256.7423 1307.4240 1313.7828 1330.9836 1333.5672 1337.7536 1355.3588 1385.9938 1397.2912 1431.0022 1442.9352 1459.5129 1461.9145 1471.5944 1481.8795 1485.3365 1535.4735 1594.5367 1608.9623 1614.9283 1640.0791 1660.9476 2999.0739 3002.1079 3014.5348 3037.0814 3061.8343 3100.9531 3111.6856 3112.3048 3120.2279 3128.5887 3140.6844 3151.6209 3165.5049 3348.9613 3515.4882 3561.2036
redmass: 4.9059 7.1726 6.1790 6.1823 4.6828 5.3029 8.2939 7.7110 4.5741 4.3628 5.5622 1.1629 2.8281 4.5286 4.4901 6.1986 5.0710 4.1045 4.9676 2.5549 2.8356 4.2014 3.7080 2.0302 4.6586 3.9540 1.2280 4.2913 3.3850 5.7872 2.8916 3.7013 2.1041 7.3291 1.8912 5.1864 2.2597 1.5981 4.7857 3.5043 1.8921 1.3489 4.0707 2.1444 1.4739 1.8602 1.4318 5.1544 2.9819 1.3731 2.6166 2.2184 1.8769 3.2396 2.3192 1.5188 2.6596 3.0390 1.0544 1.1168 2.2787 2.7147 2.0119 1.1720 1.1698 2.4941 1.6209 1.2544 1.2855 1.3811 1.2628 7.9180 1.2249 1.0812 2.1799 1.1463 1.0767 1.2209 1.5601 2.1365 1.7518 6.1314 8.7207 6.0691 5.0930 9.0295 1.0603 1.0364 1.0845 1.0584 1.0996 1.1008 1.1075 1.0992 1.0869 1.0872 1.0920 1.0964 1.1016 1.0833 1.0639 1.0778
irintensity: 0.2282 0.4154 0.3910 1.6539 0.1963 0.0147 7.1287 1.1171 8.6262 7.7751 1.9948 0.4919 3.0406 3.5799 6.3393 8.7768 5.3554 19.0014 1.0937 17.0995 0.2888 11.5833 0.6784 17.7909 17.3275 40.3574 109.6898 20.3994 30.6908 1.4508 29.5032 30.9999 73.9135 25.4516 59.3438 12.1363 58.9738 68.1862 30.5432 9.8655 103.8374 1.9230 26.6029 18.2446 3.2189 8.9117 1.4368 6.5784 116.3617 11.5401 50.9075 2.7055 63.5329 100.5593 87.9516 9.3511 7.4561 15.0557 0.0791 5.1427 313.8232 11.3314 55.8669 17.2751 15.2687 48.9277 29.0987 2.8283 7.9480 12.2965 7.7544 0.7965 38.2537 22.0446 10.5297 37.7559 23.5594 137.1497 153.0392 92.5283 240.8491 3.9908 58.3473 1.1786 302.7329 313.8487 42.7460 14.0001 6.5698 30.4356 3.4785 19.6890 5.0512 17.7495 6.2217 1.4849 17.5353 24.9940 23.3296 295.0429 25.3560 44.8444
temp: 298.150 k
press: 1.00000 atm
elementType: 8 8 8 8 8 7 7 6 6 6 6 6 6 6 6 6 6 6 6 6 1 1 1 1 1 1 1 1 1 1 1 1 1 1 1 1
symmnumber: 1
zpe: 737997.6 jmol-1
zpe.correction: 0.281088 hartree
zpe.thermalcorrener: 0.301018 hartree
zpe.thermalcorrenthalpy: 0.301962 hartree
zpe.thermalcorrgfe: 0.228263 hartree
zpe.sumelectzpe: -989.153372 hartree
zpe.sumelectthermal: -989.133442 hartree
zpe.sumelectthermalent: -989.132498 hartree
zpe.sumelectthermalfe: -989.206197 hartree
dipole: 4.5829 0.5914 -0.6493
dipole: 4.6663
quadrupole: -129.7801 -118.0101 -107.6886
quadrupole: -2.2019 -3.9133 6.3256
quadrupole: -11.2872 0.4828 10.8044 -2.2019 -3.9133 6.3256
hfenergy: -989.4344601 hartree
pointgroup: C01 [X(C13H16N2O5)]
dipole: -1.8005352 0.0045143 -0.3584192 debye
polarizability: 211.7942865|-4.1629453|146.6454589|7.9806133|-2.5901674|145.6206686 unknown
InChI: InChI=1S/C13H16N2O5/c1-9(12(18)14-7-11(16)17)15-13(19)20-8-10-5-3-2-4-6-10/h2-6,9,14-16H,7-8H2,1H3
charge 0 multiplicity 1
36 atoms
O  -0.811988 0.426547 -1.156529
O  4.022568 -1.940455 -0.742025
O  0.084294 -0.222556 0.930513
O  3.069128 1.804363 -0.120369
O  4.846732 2.413235 1.24634
N  0.674767 -1.294099 -1.064406
N  2.917481 -0.715108 0.911694
C  1.57691 -2.283288 -0.431748
C  1.732399 -3.512817 -1.334991
C  2.962238 -1.638943 -0.116179
C  -1.630301 1.482385 -0.460045
C  -3.00437 0.969808 -0.08909
C  -0.007297 -0.359504 -0.330474
C  4.090934 0.070799 1.261986
C  -4.107987 1.185742 -0.952558
C  -3.204579 0.271706 1.130615
C  -5.392936 0.710214 -0.607597
C  -4.48815 -0.205089 1.475442
C  -5.584909 0.01364 0.608221
C  4.063669 1.535244 0.825593
H  1.109811 -2.566388 0.530694
H  2.242693 -3.245617 -2.276683
H  2.360001 -4.269123 -0.836645
H  0.746171 -3.956414 -1.556592
H  0.594066 -1.269548 -2.082322
H  1.989006 -0.458503 1.286059
H  -1.06186 1.811172 0.426725
H  -1.680433 2.286514 -1.210832
H  4.963678 -0.403166 0.771223
H  4.278536 0.063289 2.35069
H  -3.959524 1.725977 -1.89584
H  -2.347788 0.100046 1.791919
H  -6.240301 0.883758 -1.280144
H  -4.635343 -0.742364 2.41895
H  -6.581338 -0.353738 0.878632
H  3.127723 2.762883 -0.384528
