program: Gaussian 09
title: 000102910
version: EM64L-G09RevD.01
frameworkgroup: C1[X(C9H12O2)]
method: RPBEPBE
basis: SDD
operation: Freq
keyword: #pfreq=noraman
keyword: PBEPBE/SDD
title: #p freq=noraman PBEPBE/SDD
converged: YES YES NO NO
title: Mulliken charges:
elementType: O O C C C C C C C C C H H H H H H H H H H H H
charge: -0.301383 -0.439146 -0.128832 0.406890 -0.355064 -0.381793 -0.453116 -0.220876 -0.227175 -0.237897 -0.510755 0.199009 0.211385 0.214980 0.273437 0.260558 0.226367 0.228496 0.229032 0.208034 0.237902 0.204409 0.355537
chargesum: 0.00000
title: Mulliken charges with hydrogens summed into heavy atoms:
elementType: O O C C C C C C C C C
charge: -0.301383 -0.083609 0.070177 0.406890 0.071301 -0.108356 -0.192558 0.005491 0.001321 -0.008865 0.139590
polarizability: 1.33292442e+02 1.49060788e+00 9.19402764e+01 -6.44794167e-01 1.71889636e+01 7.39858847e+01
1716.lowfreq: -9.3819 -2.7829 -0.0001 0.0003 0.0004 14.9973 36.5871 49.5014 85.8459
frequency: 36.0000 49.4623 85.8328 118.1365 160.3381 178.8071 230.8091 316.4699 327.2486 363.8626 385.7961 411.7036 467.0436 537.9280 604.8114 615.7530 707.6494 763.9709 769.8636 860.8506 903.8284 925.8013 955.6800 980.0566 988.5138 990.3861 998.0421 1026.1001 1037.8032 1052.2896 1081.9860 1112.3514 1147.4485 1150.6679 1172.5467 1185.5193 1207.9509 1271.0487 1309.0192 1319.4251 1340.2662 1374.9103 1387.4424 1435.1725 1440.9185 1459.2271 1462.4446 1474.4096 1483.7563 1591.7892 1613.7515 2939.9299 2954.0919 2982.3267 3018.9397 3081.7455 3104.0968 3118.8152 3128.0424 3141.3177 3157.7072 3169.9007 3536.4775
redmass: 2.1062 4.2263 3.9200 2.6116 2.5775 1.6808 3.4670 3.8763 4.2658 2.3255 1.6627 2.0917 5.2203 3.2197 3.8702 6.3786 1.8476 1.7168 3.0160 1.2418 3.8844 1.5459 2.4964 1.4028 5.5602 4.1233 1.3227 2.2651 2.9526 4.6268 1.6008 1.2610 1.1978 1.4549 1.0561 1.1113 1.9543 1.2216 1.5390 1.1934 1.3843 1.4716 3.6952 1.4000 1.5792 1.0791 1.0732 1.0617 2.2420 6.1199 6.0687 1.0344 1.0818 1.0657 1.1027 1.0996 1.0983 1.0861 1.0876 1.0931 1.0971 1.0983 1.0658
irintensity: 3.9591 0.6526 3.2111 5.2839 0.2524 0.6444 1.7523 1.9463 4.0713 27.7765 137.2968 66.7238 3.9406 19.8314 1.6294 0.4544 42.8011 46.8644 1.1799 1.1471 9.3473 5.3888 52.6038 1.4262 8.0989 22.7973 0.4701 26.2976 28.9960 101.3124 8.0340 1.2363 29.5994 15.8461 0.1494 1.1614 3.1709 1.8423 9.4251 8.2322 12.3068 15.4501 5.7720 6.5338 6.5355 0.2375 11.7774 11.9289 15.8749 1.1355 3.2901 73.8112 28.4831 52.6810 68.5756 40.9972 26.0909 4.2021 2.4852 28.4859 25.5465 10.1345 4.7738
temp: 298.150 k
press: 1.00000 atm
elementType: 8 8 6 6 6 6 6 6 6 6 6 1 1 1 1 1 1 1 1 1 1 1 1
symmnumber: 1
zpe: 497684.1 jmol-1
zpe.correction: 0.189558 hartree
zpe.thermalcorrener: 0.200788 hartree
zpe.thermalcorrenthalpy: 0.201732 hartree
zpe.thermalcorrgfe: 0.151504 hartree
zpe.sumelectzpe: -499.733964 hartree
zpe.sumelectthermal: -499.722735 hartree
zpe.sumelectthermalent: -499.721790 hartree
zpe.sumelectthermalfe: -499.772018 hartree
dipole: -0.0035 -0.8341 0.4615
dipole: 0.9532
quadrupole: -54.3676 -72.1896 -64.9199
quadrupole: 5.5045 -2.7608 3.4425
quadrupole: 9.4581 -8.3639 -1.0941 5.5045 -2.7608 3.4425
hfenergy: -499.9235222 hartree
pointgroup: C01 [X(C9H12O2)]
dipole: -0.0096546 -0.3175226 -0.1993469 debye
dipolederiv: -0.9494462 0.2620365 0.11575 0.3889111 -0.6294403 -0.1860531 0.1268708 -0.1077736 -0.4538303 -0.30024 0.1611886 -0.0717996 0.125287 -0.7756912 -0.1525054 -0.1117821 -0.1521804 -0.5598936 0.4785054 -0.1655938 -0.0503176 -0.4135443 0.4560319 0.101534 -0.0818594 -0.0231706 0.3037752 0.1969711 0.0545366 0.0240631 0.0689195 -0.0935289 -0.0544668 -0.0199996 -0.0355637 -0.0731599 0.1702182 -0.1640173 -0.014363 0.0302377 0.5310789 0.0215412 0.0683291 0.0326687 0.3118145 -0.1053466 -0.0674557 0.0255305 -0.1125069 -0.0347545 -0.0716195 0.0086294 -0.058866 -0.1001125 -0.0973516 0.0362471 -0.0312769 0.0379449 -0.0691705 -0.0840068 -0.0071369 -0.1285666 -0.0885452 -0.0019105 0.0547439 -0.0536555 0.0618311 0.0320439 -0.1294554 -0.0376308 -0.1220163 -0.054925 0.0048675 -0.0456965 0.0459041 -0.0826671 -0.0008982 -0.1114454 0.0473895 -0.0989266 -0.0725276 0.0828965 0.0010936 -0.0172325 0.019824 -0.1153845 -0.0437827 -0.0250114 -0.0364713 -0.1330368 0.7039232 -0.1758509 -0.1146238 -0.037905 0.2400045 0.0429158 -0.1922761 0.1158551 0.4004522 -0.0198047 -0.0029135 0.0438258 0.0117081 -0.0294206 0.0490528 0.0425874 0.0633676 -0.1422536 0.0678552 -0.0125655 0.0704679 0.0119491 -0.0535364 0.0973613 0.0172869 0.0562972 -0.1243276 -0.1877419 -0.000387 -0.0138538 -0.0703875 0.0513034 -0.0008296 -0.014992 -0.0035177 0.0812889 0.0930277 0.0591998 -0.0468281 0.0632532 0.0537106 0.0679273 -0.0553517 0.0652149 0.1070074 0.051402 -0.0646992 0.0606735 -0.0561408 0.0273134 0.0889877 0.0570258 0.0993176 0.0672526 0.0325387 -0.0615986 0.0475621 -0.0726751 -0.007503 0.1166844 0.0615433 0.1164254 0.0692239 -0.0024927 0.0782038 -0.0563697 0.0928036 0.0198746 0.1021137 -0.0611323 0.1007683 0.0841291 -0.1390621 -0.0132713 0.0186382 -0.0125029 0.1114976 0.0359391 0.0196547 0.0339874 0.1358601 -0.0143733 0.0483351 -0.0152301 -0.0280992 0.0830571 0.0807477 0.0898182 -0.0060519 -0.2105626 0.0230294 0.0691664 0.0145663 0.1216873 -0.115532 0.0185648 0.0058265 0.0362389 0.1001697 -0.1515992 -0.0511554 -0.0355716 -0.1764069 -0.0089524 -0.0740359 -0.0505245 -0.0907911 0.0012675 0.064134 0.0004531 0.0541407 0.0284792 0.3278968 0.0848308 0.1127351 0.1437549 0.3509336 unknown
polarizability: 133.1411294|-2.8425899|93.9275275|-1.1575998|-16.071726|72.1499463 unknown
InChI: InChI=1S/C9H12O2/c1-11-9(7-10)8-5-3-2-4-6-8/h2-6,9-10H,7H2,1H3
charge 0 multiplicity 1
23 atoms
O  1.94091 -1.226868 -0.011899
O  1.331157 2.434494 0.711983
C  1.331694 0.097774 -0.22002
C  -0.180227 -0.052679 -0.154114
C  1.844958 1.072901 0.884223
C  -0.772384 -1.08348 0.618225
C  -1.01488 0.886838 -0.813033
C  -2.177596 -1.170317 0.73006
C  -2.422065 0.800863 -0.696118
C  -3.007172 -0.226288 0.079057
C  3.280659 -1.352899 -0.588343
H  1.625411 0.508076 -1.211199
H  1.582382 0.650987 1.876116
H  2.940213 1.180989 0.818489
H  -0.123384 -1.81982 1.101737
H  -0.565562 1.665679 -1.441326
H  -2.627121 -1.975748 1.322058
H  -3.057301 1.527789 -1.214801
H  -4.097159 -0.296391 0.167421
H  3.266451 -1.157806 -1.680972
H  3.588831 -2.394777 -0.407582
H  4.013444 -0.670982 -0.11059
H  0.346241 2.418765 0.830827
