program: Gaussian 09
title: 000102906
version: EM64L-G09RevD.01
frameworkgroup: C1[X(C4H4Cl2)]
method: RPBEPBE
basis: SDD
operation: Freq
keyword: #pfreq=noraman
keyword: PBEPBE/SDD
title: #p freq=noraman PBEPBE/SDD
converged: NO NO NO NO
title: Mulliken charges:
elementType: Cl Cl C C C C H H H H
charge: -0.066123 -0.066125 -0.356507 -0.356504 -0.156048 -0.156050 0.308199 0.308198 0.270481 0.270480
chargesum: 0.00000
title: Mulliken charges with hydrogens summed into heavy atoms:
elementType: Cl Cl C C C C
charge: -0.066123 -0.066125 -0.048308 -0.048306 0.114433 0.114430
polarizability: 7.71135088e+01 2.91121286e-05 5.66284160e+01 -1.52743201e+00 2.29146944e-05 3.85182962e+01
1716.lowfreq: -0.0037 -0.0033 -0.0019 4.7886 15.5957 17.5312 113.8171 208.4599 228.7387
frequency: 113.8163 208.4596 228.7385 300.2507 406.9738 541.5020 756.6955 779.0915 873.8758 924.0102 949.5004 953.7550 1015.6318 1125.9150 1142.1518 1153.5913 1192.3324 1209.3933 1268.9256 1543.2354 3116.4446 3117.6438 3190.4569 3227.1655
redmass: 7.7530 5.4333 4.4718 3.9422 6.0876 5.7321 3.8028 1.5210 3.9732 1.5376 2.6859 1.8489 1.3927 2.3280 1.4677 1.3455 1.0994 1.2230 1.9382 5.5007 1.0911 1.0866 1.0888 1.1195
irintensity: 3.7529 0.6718 4.1370 6.5601 11.2514 37.1234 28.2354 180.9492 18.7736 0.6948 0.7248 3.8658 1.7443 7.2944 12.4195 3.4151 42.3279 27.2350 32.4109 0.9964 0.5825 5.9000 0.4905 5.4014
temp: 298.150 k
press: 1.00000 atm
elementType: 17 17 6 6 6 6 1 1 1 1
symmnumber: 1
zpe: 175489.5 jmol-1
zpe.correction: 0.066840 hartree
zpe.thermalcorrener: 0.072887 hartree
zpe.thermalcorrenthalpy: 0.073831 hartree
zpe.thermalcorrgfe: 0.035762 hartree
zpe.sumelectzpe: -1074.435883 hartree
zpe.sumelectthermal: -1074.429837 hartree
zpe.sumelectthermalent: -1074.428893 hartree
zpe.sumelectthermalfe: -1074.466962 hartree
dipole: 0.0000 2.5128 0.0000
dipole: 2.5128
quadrupole: -56.0675 -46.0874 -46.9131
quadrupole: 0.0000 -2.2120 0.0000
quadrupole: -6.3781 3.6019 2.7762 0.0000 -2.2120 0.0000
hfenergy: -1074.5027237 hartree
pointgroup: C01 [X(C4H4Cl2)]
dipole: 0.0000868 -0.9886165 0.000005 debye
dipolederiv: -0.62446 0.2626672 0.0614395 0.2744573 -0.3682656 -0.0225623 0.1636349 -0.1178533 -0.2080215 -0.624359 -0.2627114 0.061438 -0.2745018 -0.3683616 0.0225748 0.1636181 0.1178854 -0.2080238 0.6964558 -0.4371739 -0.2002087 -0.5448986 0.4170009 0.0471142 -0.2188678 0.1790287 0.1802507 0.6962701 0.4372215 -0.2002059 0.5449464 0.4171773 -0.0471536 -0.218843 -0.1790716 0.1802548 -0.1722815 0.0959708 0.152857 0.0836036 -0.0654472 0.0833435 0.1172482 0.0141277 -0.1283908 -0.1722456 -0.0959883 0.152874 -0.0836219 -0.065475 -0.0833164 0.117251 -0.0141065 -0.1283921 -0.0142433 0.0536958 0.0489938 0.0803284 0.0146363 0.0533717 0.0419233 0.0333869 -0.0142787 -0.0142186 -0.0537012 0.0490049 -0.0803339 0.014612 -0.053362 0.0419302 -0.0333785 -0.014276 0.1145523 -0.0602886 -0.0630932 -0.0595265 0.0020527 -0.0311488 -0.1039416 -0.0596066 0.170439 0.1145298 0.0603082 -0.0630993 0.0595469 0.0020703 0.031139 -0.1039534 0.0595879 0.1704385 unknown
polarizability: 77.1737802|0.0019505|56.6284162|0.0567629|-0.0001046|38.4580246 unknown
InChI: InChI=1S/C4H4Cl2/c5-3-1-2-4(3)6/h1-4H
charge 0 multiplicity 1
10 atoms
Cl -2.175997 1.058385 0.209996
Cl 2.175836 1.058785 -0.209972
C  -0.624413 0.223381 -0.481664
C  0.624404 0.223502 0.481705
C  -0.580699 -1.292942 -0.364917
C  0.580961 -1.292835 0.364964
H  -0.461145 0.675072 -1.469421
H  0.461056 0.675173 1.469459
H  -1.260006 -2.061474 -0.735453
H  1.260404 -2.061246 0.735501
