program: Gaussian 09
title: 000102905
version: EM64L-G09RevD.01
frameworkgroup: C1[X(C4F8O2)]
method: RPBEPBE
basis: SDD
operation: Freq
keyword: #p
keyword: freq=noraman
keyword: PBEPBE/SDD
title: #p freq=noraman PBEPBE/SDD
converged: YES YES NO NO
title: Mulliken charges:
elementType: F F F F F F F F O O C C C C
charge: -0.121868 -0.131139 -0.113072 -0.117454 -0.149193 -0.149158 -0.118384 -0.101397 -0.224182 -0.078441 0.169861 0.392365 0.265209 0.476854
chargesum: 0.00000
title: Mulliken charges with hydrogens summed into heavy atoms:
polarizability: 5.45435349e+01 -3.46701361e+00 5.47229751e+01 3.22927540e+00 -3.07633600e+00 5.38389205e+01
1716.lowfreq: -6.4181 -0.0015 -0.0009 -0.0006 6.2350 7.3117 27.6176 37.8302 61.8310
frequency: 27.5624 37.7427 61.8110 79.7017 104.2428 131.9617 188.1191 198.4466 247.1487 276.6249 296.3578 315.3439 325.9783 383.1388 442.3429 457.7120 474.7428 505.2381 548.5421 564.7477 600.5447 611.7692 666.9021 697.7439 788.7296 913.6747 984.2443 999.6172 1030.9839 1057.9676 1062.5772 1080.4460 1114.0866 1130.3815 1193.1429 1787.6245
redmass: 18.1041 18.9334 18.0477 17.3180 17.9425 17.3540 18.1551 17.7046 18.2309 18.3818 18.5687 17.7304 17.2160 17.6847 17.2960 17.6747 17.7194 16.3230 16.6582 16.4811 15.6027 15.9413 16.4315 16.1909 16.2152 13.5798 13.1677 13.5379 12.9101 12.9730 13.0807 13.1845 12.6233 12.9009 12.4145 13.2536
irintensity: 0.0035 0.0040 0.0864 0.0698 1.0827 1.1057 1.4246 3.2990 1.2469 1.6219 0.3182 0.2807 1.4273 1.3741 4.0947 5.7420 4.0795 29.2066 20.2716 16.8640 9.9397 24.4696 4.0426 3.9647 27.4044 71.8764 185.0023 248.4739 208.0830 66.5619 202.7293 591.8749 85.5758 486.5695 54.8856 174.4967
temp: 298.150 k
press: 1.00000 atm
elementType: 9 9 9 9 9 9 9 9 8 8 6 6 6 6
symmnumber: 1
zpe: 127928.3 jmol-1
zpe.correction: 0.048725 hartree
zpe.thermalcorrener: 0.062219 hartree
zpe.thermalcorrenthalpy: 0.063164 hartree
zpe.thermalcorrgfe: 0.006578 hartree
zpe.sumelectzpe: -1100.492721 hartree
zpe.sumelectthermal: -1100.479227 hartree
zpe.sumelectthermalent: -1100.478282 hartree
zpe.sumelectthermalfe: -1100.534868 hartree
dipole: 0.1506 -0.4104 0.2437
dipole: 0.5005
quadrupole: -76.1795 -80.1412 -79.6261
quadrupole: 0.3791 -0.3184 0.7966
quadrupole: 2.4694 -1.4922 -0.9772 0.3791 -0.3184 0.7966
hfenergy: -1100.541446 hartree
pointgroup: C01[X(C4F8O2)]
dipole: -0.0498937 -0.1634141 -0.0978463 debye
dipolederiv: -0.2944717 -0.0137889 0.0497432 -0.0196511 -0.2657894 0.0738224 -0.1380972 0.0204113 -0.6427071 -0.644726 -0.1885092 -0.1581046 -0.1253286 -0.4370811 -0.1074808 -0.105655 -0.114682 -0.3398065 -0.3396495 0.1263942 -0.0061165 0.0352331 -0.7674175 0.1629846 0.0256519 0.1408745 -0.3061549 -0.3445022 0.0381513 0.1107332 0.0374992 -0.2752729 -0.023834 0.0360561 0.0065097 -0.7342345 -0.1517496 -0.0114103 -0.0659795 -0.0117273 -0.3815392 0.1415061 -0.0450599 0.0980674 -0.9195053 -0.4942194 0.0339811 -0.0097484 0.0975161 -0.7902788 -0.0483547 0.0361641 -0.0587233 -0.2817591 -0.4876803 -0.1328922 0.1132174 -0.1388808 -0.4173898 0.1903424 0.2410267 0.2334795 -0.5718201 -0.5307055 -0.1408045 -0.2366824 -0.1095737 -0.3258388 -0.1201721 -0.2329533 -0.141795 -0.5898362 -1.5728531 -0.3008495 -0.2354428 -0.1355172 -0.5400679 -0.0217449 -0.0901997 0.0569059 -0.4772745 -0.2090216 -0.031468 -0.0381105 -0.0718509 -0.6238064 -0.2513016 -0.0364374 -0.0629102 -0.562015 0.9077604 0.2926801 0.1255292 0.3536092 0.4863435 0.0318156 0.3903035 -0.0597882 0.8896305 1.4463906 -0.0893468 0.061903 0.0203127 1.5049564 -0.045827 0.0048394 0.0268388 1.4004697 0.293407 0.0877001 0.1078083 0.0120243 1.0924963 0.099119 0.0667924 -0.0305122 1.4768725 2.4220211 0.3301627 0.1812502 0.056335 1.7406858 -0.0808749 -0.1524316 -0.1146761 1.6581407 unknown
polarizability: 54.0935257|3.3520283|54.9894096|3.1161034|3.3006052|54.0224952 unknown
InChI: InChI=1S/C4F8O2/c5-1(13)2(6,3(7,8)9)14-4(10,11)12
charge 0 multiplicity 1
14 atoms
F  0.250479 -0.181151 1.726751
F  2.803421 0.088815 0.436541
F  1.82835 -1.962478 0.339099
F  1.888065 -0.648311 -1.507372
F  0.259194 1.765428 -1.337465
F  -2.250641 0.894147 0.045341
F  -2.451895 -1.163614 0.976944
F  -2.68828 -0.927194 -1.257221
O  -0.618091 -0.728853 -0.399622
O  0.468231 2.442426 0.869957
C  0.386739 0.007385 0.320969
C  1.743862 -0.65037 -0.119609
C  0.36912 1.547786 0.057218
C  -1.988454 -0.483816 -0.151432
