program: Gaussian 09
title: 000102902
version: EM64L-G09RevD.01
frameworkgroup: C1[X(C8H6Cl2O)]
method: RPBEPBE
basis: SDD
operation: Freq
keyword: #p
keyword: freq=noraman
keyword: PBEPBE/SDD
title: #p freq=noraman PBEPBE/SDD
converged: YES YES NO NO
title: Mulliken charges:
elementType: Cl Cl O C C C C C C C C H H H H H H
charge: -0.014193 -0.066886 -0.057026 0.599012 -0.628928 -0.407182 -0.339740 -0.210237 -0.209094 -0.230488 0.029324 0.325600 0.238249 0.260308 0.237029 0.236355 0.237897
chargesum: 0.00000
title: Mulliken charges with hydrogens summed into heavy atoms:
elementType: Cl Cl O C C C C C C C C
charge: -0.014193 -0.066886 -0.057026 0.599012 -0.303328 -0.168932 -0.079432 0.026792 0.027261 0.007409 0.029324
polarizability: 1.26519110e+02 1.18975948e+01 9.39756966e+01 -2.70020705e-01 1.09883564e+01 9.56460047e+01
1716.lowfreq: -14.5013 -10.0432 -4.7401 0.0016 0.0024 0.0036 22.2934 35.4975 83.3012
frequency: 22.0602 35.4835 83.2943 139.0202 165.2720 228.7986 282.5719 310.5881 396.8580 400.8950 473.8827 515.1067 610.6578 623.7077 651.2675 698.6951 749.0013 777.6111 812.6979 851.7010 926.8857 959.5626 981.3346 991.0583 1003.7598 1026.2179 1086.7558 1176.4744 1184.6063 1192.7622 1198.1624 1256.6999 1335.4951 1387.7854 1443.8201 1480.1243 1593.1747 1607.2592 1763.8611 3113.4009 3131.0445 3135.0780 3145.3062 3157.1278 3171.8559
redmass: 9.5659 5.3630 8.6550 7.4870 9.7715 7.3409 8.8136 7.3325 6.9153 3.5246 4.8645 5.9395 6.4881 8.2457 6.3913 1.6797 7.0951 2.0245 5.0164 1.2514 1.5906 3.5563 1.3978 6.0644 1.3387 2.2261 1.6153 1.0710 1.1309 1.1876 1.9915 1.5845 1.2648 8.1946 2.1787 2.2164 6.0425 5.9629 11.9165 1.0869 1.0861 1.0881 1.0923 1.0966 1.1017
irintensity: 0.1054 0.2721 0.2298 4.2133 1.9604 0.9122 4.3668 1.0686 10.4748 2.3975 2.9151 23.2285 0.8658 107.9984 109.7604 81.2432 57.8188 14.1725 11.6412 0.0388 7.4727 53.7680 0.0910 2.2784 0.3027 3.2964 8.5282 0.8218 5.9618 9.2642 21.7110 7.1882 1.5489 1.5352 12.5920 4.9384 1.4562 2.5513 205.7248 1.7980 2.1295 0.0783 8.9666 22.4168 17.2326
temp: 298.150 k
press: 1.00000 atm
elementType: 17 17 8 6 6 6 6 6 6 6 6 1 1 1 1 1 1
symmnumber: 1
zpe: 306715.2 jmol-1
zpe.correction: 0.116822 hartree
zpe.thermalcorrener: 0.127160 hartree
zpe.thermalcorrenthalpy: 0.128104 hartree
zpe.thermalcorrgfe: 0.078017 hartree
zpe.sumelectzpe: -1303.007040 hartree
zpe.sumelectthermal: -1302.996702 hartree
zpe.sumelectthermalent: -1302.995757 hartree
zpe.sumelectthermalfe: -1303.045845 hartree
dipole: -3.6124 -0.5700 -1.3115
dipole: 3.8852
quadrupole: -73.5850 -85.4724 -71.7534
quadrupole: 2.9380 -4.0146 1.3800
quadrupole: 3.3520 -8.5355 5.1835 2.9380 -4.0146 1.3800
hfenergy: -1303.1238618 hartree
pointgroup: C01 [X(C8H6Cl2O1)]
dipole: -1.4655618 -0.2224815 0.3729485 debye
dipolederiv: -0.3887114 0.1251882 0.0587077 0.2495134 -0.4002968 -0.2243415 0.2681258 -0.324368 -0.3806454 -0.2212855 -0.1000487 -0.1224651 -0.1504544 -0.2815769 -0.2813854 -0.2366186 -0.2645692 -0.9605995 -0.4376687 -0.1588843 0.2810898 -0.3307242 -0.3539162 0.2163814 0.1524792 0.0071 -0.8705796 -0.1630906 0.0919777 0.0105005 -0.0867296 -0.1046712 -0.0674912 -0.0758778 -0.0405603 -0.0537621 0.4848824 -0.360182 -0.0973894 -0.3632453 0.4526987 0.3086717 -0.1819576 0.4063061 0.421971 0.0016566 -0.099895 0.0358482 0.0518505 -0.02969 -0.1118657 -0.0925886 -0.0902473 -0.0388776 -0.0135032 0.0372206 -0.0816012 -0.1060152 -0.0544108 -0.0158924 -0.0113013 -0.0509942 -0.0720565 -0.0341164 0.0827255 -0.1271736 0.1032075 -0.0993869 -0.0550108 -0.135732 -0.0444295 -0.0188546 -0.126484 -0.0530102 0.0732327 -0.0527475 0.0135527 -0.1315623 0.0815673 -0.1406478 -0.0078926 0.1107744 -0.0608976 -0.0111375 -0.0757859 -0.0653929 -0.0667241 -0.0016006 -0.0576652 -0.0711869 0.6509107 0.4044649 -0.1351868 0.653154 0.5472179 0.106501 0.1609722 0.2283953 1.7627793 0.0797415 -0.0080529 0.0243795 0.005812 0.0217719 -0.0445245 -0.0354627 -0.0113814 -0.0497831 0.0746011 0.0663038 -0.0478235 0.045036 0.0277913 0.0978203 -0.0254339 0.0995642 0.0464092 0.0268395 -0.0388971 0.0767534 -0.0309856 0.0993692 0.0383383 0.0679926 0.0482852 0.0812453 -0.016098 -0.0391411 0.0846233 -0.0391181 0.0951355 0.081865 0.0985365 0.0804858 0.0507432 0.0636645 0.0437549 -0.0211763 0.0587533 0.0268581 0.117165 -0.0313385 0.1218149 0.038508 -0.0921129 0.0673732 -0.0011818 0.0684792 0.1049464 0.0320552 -0.001762 0.0329114 0.1225817 unknown
polarizability: 127.4972595|-8.5255527|84.7024306|-7.2596617|-3.6625933|103.9411211 unknown
InChI: InChI=1S/C8H6Cl2O/c9-7(8(10)11)6-4-2-1-3-5-6/h1-5,7H
charge 0 multiplicity 1
17 atoms
Cl 1.569581 -1.894169 -1.3811
Cl 2.291397 0.883543 2.025566
O  2.738952 0.923906 -0.680235
C  -0.297169 -0.317262 0.051496
C  1.130827 -0.812072 0.131817
C  -1.272662 -0.882774 0.909603
C  -0.672052 0.68898 -0.876195
C  -2.613216 -0.445225 0.843506
C  -2.012099 1.122908 -0.939388
C  -2.985072 0.558306 -0.080371
C  2.13027 0.338183 0.198737
H  1.282812 -1.475125 0.994222
H  -0.984093 -1.660341 1.62643
H  0.076215 1.120509 -1.550572
H  -3.363409 -0.885035 1.509111
H  -2.299454 1.898998 -1.656626
H  -4.025127 0.89827 -0.131502
