program: Gaussian 09
title: 000102901
version: EM64L-G09RevD.01
frameworkgroup: C1[X(C5H13NOS)]
method: RPBEPBE
basis: SDD
operation: Freq
keyword: #p
keyword: freq=noraman
keyword: PBEPBE/SDD
title: #p freq=noraman PBEPBE/SDD
converged: YES YES NO NO
title: Mulliken charges:
elementType: S O N C C C C C H H H H H H H H H H H H H
charge: 0.144449 -0.432140 -0.622581 -0.105006 -0.337871 -0.691878 -0.351726 -0.841935 0.193756 0.210069 0.232777 0.265159 0.279840 0.241951 0.180854 0.267680 0.276851 0.330461 0.255427 0.253398 0.250463
chargesum: 0.00000
title: Mulliken charges with hydrogens summed into heavy atoms:
elementType: S O N C C C C C
charge: 0.144449 -0.101678 -0.078050 0.088751 0.104974 -0.146878 0.071079 -0.082646
polarizability: 1.03177599e+02 -2.75799649e+00 6.87060652e+01 3.23806169e+00 6.97491466e-01 7.36817320e+01
1716.lowfreq: -10.7868 -7.9343 -0.0025 -0.0017 -0.0011 12.4044 36.8532 53.3855 76.0082
frequency: 36.1903 53.1210 75.8285 122.5514 149.5852 161.4835 213.1940 235.9648 252.6095 290.1618 306.8120 369.5788 476.1111 529.2791 607.6922 666.1755 732.0726 775.1742 837.6922 944.5778 957.1149 963.0855 979.0398 984.7116 1031.7044 1057.5672 1087.8421 1141.6363 1166.7023 1228.7927 1251.4922 1286.5527 1298.4912 1333.1908 1341.7010 1355.5237 1372.7650 1391.5480 1448.2655 1457.6760 1461.6370 1466.5676 1473.0326 1637.0095 2813.7456 2941.6518 2976.8370 2998.6225 3016.8390 3053.2817 3095.0341 3100.5444 3110.0107 3127.6847 3458.6522 3557.4092 3586.3750
redmass: 3.6818 4.0305 2.8253 2.6833 1.1572 2.1790 3.1241 1.0871 2.9381 3.0068 1.3548 2.2346 3.6316 2.1086 1.6554 6.8623 3.6577 1.2838 2.6966 1.5287 2.1985 1.5489 1.4720 1.4283 2.1222 2.3475 1.4037 1.2428 1.6385 1.3673 1.2611 1.1325 1.2029 1.3370 1.1800 1.3887 1.3199 1.5485 1.0536 1.0763 1.0648 1.0845 1.0826 1.0978 1.0808 1.0713 1.0660 1.0291 1.0560 1.0959 1.1069 1.0938 1.1057 1.1023 1.0449 1.0660 1.0980
irintensity: 5.2341 1.1247 2.2740 4.5938 0.5092 0.6776 2.9187 32.4976 6.3030 32.4873 129.2882 44.6590 12.7159 74.8167 143.4473 3.2068 8.5446 6.9330 1.4108 12.9744 26.7147 54.2952 5.4571 9.7208 16.3847 1.3139 11.2473 17.8905 2.3692 0.2352 6.2242 1.7444 6.9952 33.7101 10.4307 12.4573 2.3440 4.7308 15.5423 16.7461 6.5321 7.4591 9.0473 61.5521 138.3018 95.5146 27.9819 41.2365 21.2440 8.3974 33.3306 24.8961 19.9981 13.7526 0.7572 4.4210 0.3433
temp: 298.150 k
press: 1.00000 atm
elementType: 16 8 7 6 6 6 6 6 1 1 1 1 1 1 1 1 1 1 1 1 1
symmnumber: 1
zpe: 471605.0 jmol-1
zpe.correction: 0.179625 hartree
zpe.thermalcorrener: 0.191055 hartree
zpe.thermalcorrenthalpy: 0.192000 hartree
zpe.thermalcorrgfe: 0.141430 hartree
zpe.sumelectzpe: -725.652203 hartree
zpe.sumelectthermal: -725.640772 hartree
zpe.sumelectthermalent: -725.639828 hartree
zpe.sumelectthermalfe: -725.690398 hartree
dipole: -2.2859 2.0476 0.2718
dipole: 3.0808
quadrupole: -49.2084 -60.3526 -57.9427
quadrupole: -5.8233 7.7657 0.1549
quadrupole: 6.6262 -4.5180 -2.1081 -5.8233 7.7657 0.1549
hfenergy: -725.8318277 hartree
pointgroup: C01 [X(C5H13N1O1S1)]
dipole: -0.9336322 0.7656967 0.1059412 debye
dipolederiv: -0.2437337 0.0143535 -0.055521 0.0057957 -0.199844 -0.0100162 -0.0182381 -0.0191096 -0.0293838 -0.4313359 -0.2281983 0.1785066 -0.2483026 -0.7552535 -0.129224 0.2161094 -0.1360377 -0.3796011 -0.467885 0.0356623 -0.1759056 0.0330401 -0.5995362 -0.1416712 -0.1899286 -0.116412 -0.6000172 0.3119164 -0.0637681 0.1120283 -0.0442372 0.4394243 0.17132 0.1113395 0.1602049 0.347119 -0.0912777 0.0535007 -0.0174984 -0.0000043 0.076822 -0.0005908 0.1728076 -0.0592107 0.0571585 0.2762144 0.0142618 -0.1103479 0.0348051 0.1403164 0.0204554 -0.1028053 0.0042752 -0.025318 0.3674014 0.0703926 -0.0563768 0.1177039 0.5053055 0.1437285 -0.0244598 0.1669896 0.3010447 0.0206037 -0.0118086 0.1199635 -0.0130409 0.0818511 -0.009353 0.0992472 -0.0057577 0.0799559 -0.195212 -0.0451441 -0.1796289 -0.0140712 -0.0484307 -0.0594209 -0.1529843 -0.0723665 -0.2079029 0.0431277 -0.0403572 0.0598187 -0.0325753 -0.06361 0.1253932 0.0018561 0.1124323 -0.0203916 0.0718276 0.0069722 -0.020946 0.0085785 -0.0353005 -0.1159696 -0.0476347 -0.0861476 0.0106738 -0.0197235 -0.0146778 0.0343755 -0.0212382 -0.0645298 0.0997059 0.0606122 0.0994915 -0.0142965 0.0242793 -0.0057761 0.0317208 -0.0324944 -0.0018781 -0.0902194 0.0399156 -0.0858936 -0.0326381 0.0337605 0.0192186 -0.1282871 0.0226491 0.0362975 0.0084436 -0.1137774 -0.007372 -0.0309431 -0.2115644 0.0662181 0.1437497 0.0536116 -0.0502187 -0.0793254 0.0962348 -0.0470981 0.0008269 0.0027921 0.0637684 0.1244056 0.0301578 0.1620914 -0.0499736 0.0471295 -0.0298866 0.2988592 0.2769002 -0.0336301 0.0898869 -0.0749216 0.0655337 0.0368616 0.1302764 0.105637 0.1561097 0.2325394 0.1001003 -0.1545444 0.1563566 0.296181 0.0723155 -0.1905599 -0.0001405 0.1386526 0.0691271 -0.055664 -0.0099873 -0.0108278 -0.083616 0.1082565 -0.0731068 0.1138736 -0.0303794 0.0737883 0.0450184 -0.0094013 0.019205 -0.0285722 -0.1064648 -0.0815012 -0.104963 -0.0959103 -0.1435456 0.0095574 0.0239892 0.0098101 0.1269667 0.0057488 0.0194677 0.0074917 0.0763818 unknown
polarizability: 103.4282648|-1.1287986|68.5552537|2.8694397|0.9372474|73.5818773 unknown
InChI: InChI=1S/C5H13NOS/c1-8-3-2-5(6)4-7/h5,7H,2-4,6H2,1H3
charge 0 multiplicity 1
21 atoms
S  2.641569 0.125458 -0.701727
O  -2.159538 -1.892766 -0.05513
N  -1.556988 1.800727 0.385917
C  -1.560614 0.522248 -0.351743
C  -0.14958 0.231868 -0.925973
C  0.945261 0.099507 0.146933
C  -2.059531 -0.585186 0.60642
C  3.716238 -0.141969 0.819763
H  -2.25886 0.53153 -1.231983
H  0.115021 1.053304 -1.624099
H  -0.198184 -0.698016 -1.521549
H  0.85913 -0.857825 0.688659
H  0.896043 0.936272 0.863349
H  -1.347208 -0.730089 1.432376
H  -3.039592 -0.286718 1.041716
H  -2.458903 2.071141 0.789814
H  -1.105134 2.574118 -0.110827
H  -2.802372 -1.823102 -0.805792
H  3.481659 -1.111998 1.287395
H  3.56719 0.675719 1.543559
H  4.762193 -0.143022 0.475222
