program: Gaussian 09
title: 000102897
version: EM64L-G09RevD.01
frameworkgroup: C1[X(C9H12O)]
method: RPBEPBE
basis: SDD
operation: Freq
keyword: #pfreq=noraman
keyword: PBEPBE/SDD
title: #p freq=noraman PBEPBE/SDD
converged: NO YES NO NO
title: Mulliken charges:
elementType: O C C C C C C C C C H H H H H H H H H H H H
charge: -0.308993 -0.135216 -0.231649 -0.123635 -0.175706 -0.540462 -0.151241 -0.499447 -0.060660 -0.614411 0.249142 0.263528 0.244783 0.246605 0.274754 0.220505 0.217740 0.215851 0.243308 0.231487 0.216390 0.217327
chargesum: 0.00000
title: Mulliken charges with hydrogens summed into heavy atoms:
elementType: O C C C C C C C C C
charge: -0.308993 0.113926 0.031879 0.121147 0.070899 -0.045202 0.066499 -0.040288 0.170827 -0.180694
polarizability: 1.15091512e+02 6.66073773e+00 8.00562688e+01 2.54952701e+00 2.53165095e+00 7.69813746e+01
1716.lowfreq: -23.6960 -5.5007 0.0003 0.0005 0.0007 21.9793 81.0117 107.7722 231.5352
frequency: 80.7178 107.7101 231.5079 288.3052 329.7648 354.0599 386.7350 436.5905 523.3432 606.8864 666.9820 746.6569 756.2424 770.1324 807.7967 824.5619 869.1275 886.1165 906.3859 914.4395 929.0498 939.1516 971.7860 973.1558 991.5115 1004.8108 1005.8018 1031.0983 1044.2776 1101.7318 1117.3460 1154.3571 1162.3751 1170.8882 1201.8866 1234.0618 1251.2627 1261.5303 1272.4881 1277.8643 1289.9890 1302.0128 1308.8142 1348.3752 1428.3987 1460.5085 1474.1198 1653.1755 2993.9514 3005.1322 3041.1241 3063.0227 3069.5457 3081.3197 3087.4592 3090.2934 3120.6425 3133.1442 3151.6587 3192.8384
redmass: 2.8067 3.2194 2.1007 2.5977 3.7115 3.0592 2.9627 2.4601 3.3472 3.2813 1.7642 5.0789 4.0616 4.0176 3.0834 2.3480 2.4003 2.1046 2.0997 2.1095 2.9095 1.3341 1.5320 1.6666 1.5098 1.5821 1.1516 2.5221 1.3024 1.2869 1.1180 2.2730 1.4237 1.5036 1.4775 1.3637 1.4432 1.3393 1.7828 1.5294 1.3660 1.4287 1.4775 2.5694 1.2056 1.0876 1.0949 4.7261 1.0803 1.0651 1.0626 1.1003 1.0834 1.0885 1.0731 1.0909 1.1032 1.0883 1.1003 1.1142
irintensity: 0.1471 0.8528 0.8978 2.1177 2.0946 2.6589 4.0115 10.2508 5.3482 1.8827 10.0826 0.5683 0.6050 3.2130 51.8555 0.2124 13.4607 5.9980 3.8212 3.2023 6.7767 78.7123 12.7252 2.7103 9.5941 4.8315 10.3240 0.6157 1.2061 1.3212 1.5516 0.6957 5.2946 5.6609 1.5466 0.5350 1.6925 0.3318 3.7867 3.3996 1.2740 4.9239 6.1485 6.6168 5.4927 15.3691 9.5267 20.7792 19.3955 36.8802 20.8256 10.9349 41.4231 54.9106 5.5201 16.5592 13.3632 17.1203 23.1055 26.9474
temp: 298.150 k
press: 1.00000 atm
elementType: 8 6 6 6 6 6 6 6 6 6 1 1 1 1 1 1 1 1 1 1 1 1
symmnumber: 1
zpe: 489787.2 jmol-1
zpe.correction: 0.186550 hartree
zpe.thermalcorrener: 0.194899 hartree
zpe.thermalcorrenthalpy: 0.195843 hartree
zpe.thermalcorrgfe: 0.153449 hartree
zpe.sumelectzpe: -424.538388 hartree
zpe.sumelectthermal: -424.530038 hartree
zpe.sumelectthermalent: -424.529094 hartree
zpe.sumelectthermalfe: -424.571488 hartree
dipole: -1.9805 1.0020 -0.9672
dipole: 2.4212
quadrupole: -69.0247 -59.2767 -57.0845
quadrupole: 3.9934 -3.0951 2.1118
quadrupole: -7.2294 2.5186 4.7108 3.9934 -3.0951 2.1118
hfenergy: -424.7249376 hartree
pointgroup: C01 [X(C9H12O1)]
dipole: -0.7831808 -0.4140805 0.3500578 debye
dipolederiv: -0.8502518 -0.2064408 0.0413355 -0.2192874 -0.3371093 -0.0029524 0.0993919 0.0292198 -0.3924851 0.4137311 0.0522791 0.0576562 0.1062274 0.1038727 0.0589384 0.0861665 0.1313219 0.1885592 -0.0625665 -0.0176055 -0.0017273 -0.0344484 0.0856461 -0.0677369 -0.0923228 -0.0906416 0.0347521 0.2935507 0.181843 0.051323 0.1400887 0.1645453 0.0180066 0.1170898 -0.0601303 0.2275424 0.0119961 -0.0845332 -0.0371873 -0.0431457 0.1021826 0.0487648 -0.0774225 0.090994 -0.0172455 0.0433526 0.0402225 0.0070648 0.0313262 -0.0338436 0.0035457 0.0367782 0.0157777 -0.0271961 -0.0408358 0.0151495 -0.0122112 0.0484815 0.0670137 0.0109245 -0.0411119 0.0000159 0.0919079 -0.0254575 0.0490022 0.0296891 -0.0263247 0.0259977 0.0082602 -0.0422017 -0.0188461 0.1221464 0.331888 -0.1033435 0.0114725 -0.0731518 -0.1563456 0.1172408 0.1819476 0.1035333 0.077419 -0.242666 0.0106264 0.0963687 0.0118207 -0.3255632 0.1741519 0.0966063 0.1700028 0.0171555 0.0226412 0.0246462 -0.0099827 0.0153101 0.002205 -0.106132 -0.0225985 -0.1272718 -0.008306 0.0422075 0.0641302 -0.0384196 0.0650591 -0.084438 0.0763873 -0.0428244 0.0860311 0.0254468 0.0507411 -0.0164869 -0.0803816 -0.0090512 0.0279913 0.0518128 -0.1047433 0.0669884 -0.0635485 -0.0074962 0.0933134 0.0194512 0.0892505 -0.125504 -0.0432555 0.0270221 -0.0565371 0.0670708 -0.0189924 -0.0122156 0.128917 -0.0185957 0.0668657 0.0518637 0.0750366 0.0257728 0.0137097 -0.016295 -0.0718172 -0.139129 -0.0698488 0.0375162 -0.0674025 -0.1060038 -0.0461132 -0.0004751 0.0157661 0.0245736 0.0308719 0.014717 -0.0026413 -0.0833746 0.0149506 -0.085025 -0.1261765 0.0314817 0.0363961 -0.010375 0.0353185 0.0374282 0.0408136 -0.0064936 0.1016135 -0.153419 -0.0261806 -0.1277758 -0.0421819 -0.103962 -0.0413973 -0.0280753 -0.0530313 -0.0887854 0.0328918 0.0505447 0.0300947 0.0232449 0.0033859 0.0845463 -0.1069612 -0.0455388 -0.090238 -0.0878286 -0.1005214 0.020402 -0.080843 0.0192098 0.1733377 -0.0489366 -0.1023261 -0.0468595 0.0516816 0.0833624 -0.0024604 -0.0449561 0.0176202 0.1276939 -0.105883 0.001629 -0.1108231 -0.0736027 unknown
polarizability: 114.9135484|-6.8497768|79.7913533|-3.1546469|2.8020267|77.4242541 unknown
InChI: InChI=1S/C9H12O/c1-2-5-3-6-4-7(5)9-8(6)10-9/h2,5-9H,1,3-4H2
charge 0 multiplicity 1
22 atoms
O  2.609517 0.756685 -0.031548
C  1.216138 1.042275 0.501969
C  0.058074 0.818994 -0.490412
C  1.821984 -0.315165 0.704717
C  0.988453 -1.258759 -0.183683
C  0.61193 -0.332794 -1.377627
C  -1.035134 0.073211 0.378845
C  -0.391682 -1.370913 0.549713
C  -2.393078 0.037849 -0.285104
C  -3.545022 0.502478 0.260807
H  1.167811 1.816593 1.274264
H  -0.312163 1.715607 -1.008953
H  2.27394 -0.655256 1.641882
H  1.459564 -2.221091 -0.435032
H  1.481648 -0.027527 -1.97704
H  -0.155271 -0.780891 -2.031362
H  -1.137684 0.568498 1.363857
H  -0.290648 -1.646331 1.615212
H  -1.023234 -2.138934 0.067587
H  -2.422337 -0.408241 -1.292549
H  -4.499586 0.447414 -0.274417
H  -3.56602 0.951299 1.262375
