program: Gaussian 09
title: 000102890
version: EM64L-G09RevD.01
frameworkgroup: C1[X(C5H9Cl3O2)]
method: RPBEPBE
basis: SDD
operation: Freq
keyword: #p
keyword: freq=noraman
keyword: PBEPBE/SDD
title: #p freq=noraman PBEPBE/SDD
converged: YES YES NO NO
title: Mulliken charges:
elementType: Cl Cl Cl O O C C C C C H H H H H H H H H
charge: 0.115998 0.094651 0.116178 -0.252031 -0.382272 0.046380 0.101399 -0.686484 -0.666061 -0.644897 0.219933 0.251464 0.204950 0.231747 0.228408 0.215698 0.215232 0.233140 0.356567
chargesum: 0.00000
title: Mulliken charges with hydrogens summed into heavy atoms:
elementType: Cl Cl Cl O O C C C C C
charge: 0.115998 0.094651 0.116178 -0.252031 -0.025705 0.266313 0.352863 -0.021379 -0.001991 -0.644897
polarizability: 9.91569221e+01 -4.67572874e+00 9.12309931e+01 -7.30226048e+00 -2.27774428e+00 8.36490020e+01
1716.lowfreq: -8.5775 -0.0033 -0.0025 -0.0019 5.4563 8.5437 27.6142 47.5108 69.4577
frequency: 27.4258 47.4834 69.4467 131.5038 176.9608 181.0043 196.0761 212.5502 233.4577 248.3113 271.5814 303.6943 364.8064 382.9163 406.8490 414.5156 444.4338 558.5704 605.0045 710.4595 756.7566 825.7775 896.2454 923.2496 938.3301 946.0392 993.4140 1051.1586 1105.8819 1152.6125 1182.4778 1240.9002 1296.4885 1331.8347 1347.1886 1375.0124 1384.9872 1396.5609 1456.4802 1462.2129 1472.4008 1483.8828 2985.6948 2990.1241 2994.4569 3043.3185 3078.1998 3091.2780 3098.0366 3103.3046 3515.9284
redmass: 2.9206 5.7468 5.4220 6.3794 8.3136 1.0682 3.7514 3.9247 1.4803 10.8829 12.8480 4.4841 3.8763 3.1485 2.7213 2.4215 2.1419 4.3194 4.2483 6.6589 8.9080 3.9287 2.6998 1.2338 1.4048 4.4617 9.6875 5.5237 1.7475 2.1058 1.9788 1.3463 1.1665 1.3214 1.3878 1.1654 1.2444 1.2171 1.0482 1.0482 1.0512 1.0490 1.0398 1.0791 1.0380 1.0844 1.0988 1.1003 1.0999 1.1002 1.0647
irintensity: 0.0943 0.6101 0.1791 0.4749 1.6544 0.0581 0.6793 3.2835 1.4616 2.6297 0.0542 1.5508 24.6545 3.6723 26.4423 41.8401 59.6231 68.3432 99.2198 98.0243 124.0674 51.6836 11.3728 2.9345 4.3172 105.1387 280.1332 60.4717 54.3248 13.0367 11.7368 40.0549 28.6206 4.3911 5.4668 16.5270 37.5865 25.1664 7.3965 0.7325 10.1693 15.9934 17.0073 17.8788 16.2325 13.0197 34.0637 9.8774 41.1057 33.2606 15.6398
temp: 298.150 k
press: 1.00000 atm
elementType: 17 17 17 8 8 6 6 6 6 6 1 1 1 1 1 1 1 1 1
symmnumber: 1
zpe: 358325.1 jmol-1
zpe.correction: 0.136479 hartree
zpe.thermalcorrener: 0.149243 hartree
zpe.thermalcorrenthalpy: 0.150187 hartree
zpe.thermalcorrgfe: 0.095893 hartree
zpe.sumelectzpe: -1725.714282 hartree
zpe.sumelectthermal: -1725.701518 hartree
zpe.sumelectthermalent: -1725.700574 hartree
zpe.sumelectthermalfe: -1725.754868 hartree
dipole: -2.8735 -0.0969 -0.5319
dipole: 2.9239
quadrupole: -75.6888 -78.1367 -84.1012
quadrupole: -1.1220 1.4901 -3.1820
quadrupole: 3.6201 1.1722 -4.7923 -1.1220 1.4901 -3.1820
hfenergy: -1725.8507612 hartree
pointgroup: C01 [X(C5H9Cl3O2)]
dipole: -1.1222042 -0.0723347 -0.2423355 debye
dipolederiv: -0.5899141 0.0494318 0.3309082 0.0329259 -0.1373828 -0.0188861 0.3047022 -0.0326895 -0.4024078 -0.1796655 0.0409811 -0.089038 0.0129933 -0.3911625 0.2960206 -0.0796231 0.2830778 -0.5474632 -0.1879543 0.0711551 0.0090737 0.1083656 -0.7516435 -0.1595737 0.0111552 -0.1623604 -0.1803837 -1.5513283 0.1998692 0.0661264 0.0752198 -0.4729763 0.0213677 0.1309562 -0.090574 -0.3749756 -0.7423769 -0.0540672 -0.0251084 0.1293937 -0.831159 -0.2843424 0.0929814 -0.2396002 -0.2376402 1.0188308 -0.1005598 0.0485288 -0.0826949 0.4090632 -0.0688142 0.2618797 -0.0829808 0.2972359 1.1424361 -0.0380033 -0.0135969 -0.0954645 0.7347204 0.2428861 -0.3742353 0.2978628 0.2698009 -0.1058082 -0.0161749 0.0639781 -0.0361993 0.0082187 0.0623828 0.0579053 0.0586851 -0.0251179 -0.0621298 0.019224 0.0114219 0.066495 -0.1555311 0.1114828 -0.0710057 0.0928001 0.0062487 0.8213894 -0.235278 -0.3193571 -0.2069528 1.2241729 -0.1466881 -0.3211629 -0.1768609 1.1471403 -0.0286501 0.0228975 0.0289193 -0.0090123 -0.0546803 -0.0829434 -0.0582544 -0.0758045 -0.0774893 0.0123868 0.0177981 -0.0562563 -0.030729 -0.0182498 0.0251444 0.0439188 0.0692478 -0.0432162 -0.1526395 -0.0027832 -0.059926 0.0129206 0.1091406 0.0101722 -0.0822835 0.0033153 0.0481941 0.1032662 0.0604436 -0.0100879 0.0256521 -0.1145435 0.0845876 0.0148161 0.0734679 0.0551015 0.1074615 -0.0290327 -0.0205337 -0.0053321 -0.0048087 -0.1281991 0.02534 -0.0800809 -0.0372623 -0.1321198 0.0265561 -0.1074269 0.0124833 0.083634 -0.0085556 -0.1019473 0.009544 0.0659775 -0.015377 -0.0677172 0.1417293 -0.0433532 0.0415582 0.0401887 0.1399641 0.0503937 -0.0178464 0.1147949 -0.008955 -0.0097959 0.0083037 -0.002666 -0.0650906 0.0106954 -0.1238726 -0.0417632 0.4273979 0.0442147 0.0104413 0.0249852 0.3242953 0.0688603 -0.0058022 0.1264291 0.0958668 unknown
polarizability: 99.7112496|-5.2322131|90.5437811|-6.1982647|-3.2854826|83.7818865 unknown
InChI: InChI=1S/C5H9Cl3O2/c1-3(2)10-4(9)5(6,7)8/h3-4,9H,1-2H3
charge 0 multiplicity 1
19 atoms
Cl 3.063683 0.090976 -0.925492
Cl 1.909284 -0.830601 1.716809
Cl 1.383525 1.99046 0.705681
O  -0.773081 -0.153301 0.374378
O  0.476382 -1.642794 -1.019479
C  -2.124835 -0.108007 -0.286371
C  0.32135 -0.287398 -0.542052
C  -3.109876 -0.558971 0.794578
C  -2.404906 1.310837 -0.808057
C  1.593783 0.219115 0.205073
H  -2.112772 -0.837049 -1.122248
H  0.203373 0.316064 -1.461681
H  -4.142064 -0.549205 0.400461
H  -2.872449 -1.579905 1.138017
H  -3.059729 0.119893 1.664032
H  -3.398214 1.346133 -1.292127
H  -1.657626 1.632639 -1.555922
H  -2.392924 2.034106 0.025615
H  0.590095 -2.240992 -0.232516
