program: Gaussian 09
title: 000103141
version: EM64L-G09RevD.01
frameworkgroup: C1[X(C23H25N2O6S3)]
method: RPBEPBE
basis: SDD
operation: Freq
keyword: #p
keyword: freq=noraman
keyword: PBEPBE/SDD
title: #p freq=noraman PBEPBE/SDD
converged: YES YES NO NO
title: Mulliken charges:
elementType: S S S O O O O O O N N C C C C C C C C C C C C C C C C C C C C C C C H H H H H H H H H H H H H H H H H H H H H H H H H
charge: 0.275443 1.082993 1.083696 -0.518098 -0.519009 -0.627315 -0.462453 -0.628679 -0.458492 -0.218995 -0.188712 -0.488598 -0.466382 0.373346 -0.078671 -0.326406 -0.323563 0.194985 0.606443 -0.312818 -0.355201 0.382434 -0.640528 -0.632360 -0.311857 -0.286212 -0.333862 -0.310797 -0.269617 -0.370132 -0.210543 -0.230517 -0.226654 -0.239370 0.277748 0.279260 0.271387 0.263255 0.273500 0.246717 0.271652 0.244813 0.251292 0.312410 0.304684 0.303109 0.312562 0.268208 0.269989 0.254853 0.251147 0.265629 0.259312 0.256769 0.259509 0.260351 0.263837 0.406677 0.407829
chargesum: 1.00000
title: Mulliken charges with hydrogens summed into heavy atoms:
elementType: S S S O O O O O O N N C C C C C C C C C C C C C C C C C C C C C C C
charge: 0.275443 1.082993 1.083696 -0.110269 -0.112332 -0.627315 -0.462453 -0.628679 -0.458492 -0.218995 -0.188712 0.068410 0.068261 0.373346 -0.078671 0.193811 0.192902 0.194985 0.606443 -0.061526 -0.355201 0.382434 -0.023434 -0.016689 -0.043649 -0.016223 -0.079009 -0.059650 -0.003988 -0.110820 0.046226 0.028992 0.033697 0.024468
polarizability: 6.65304178e+02 -9.56523015e+01 4.22792024e+02 -1.37014678e+00 -2.52326357e-01 1.92924210e+02
1716.lowfreq: -2.4160 0.0017 0.0018 0.0020 3.1152 5.3369 20.3837 31.8060 35.0405
frequency: 20.2627 31.7754 35.0049 40.9434 45.9072 56.9623 64.4572 70.9433 85.9159 96.7690 112.1366 114.9363 128.1645 136.0233 145.6174 149.6874 158.6239 164.5743 178.7629 186.1911 195.4854 206.0835 223.1795 230.1250 232.4885 250.3444 257.9518 282.0603 294.0850 300.6494 314.7657 324.9514 335.3501 348.0220 363.2435 369.5771 380.7543 399.6721 404.3944 420.5130 423.8631 437.3629 455.0327 491.4421 496.2407 498.4109 520.1548 527.1978 533.7132 545.4309 571.0629 586.6181 594.6366 601.1038 607.3842 633.5623 646.2685 655.8124 682.6414 691.6468 722.0725 725.9660 743.2301 751.8344 760.6300 761.1330 765.6866 770.7176 779.1925 783.3387 797.2591 813.1505 818.0215 834.6179 838.8972 856.2544 857.3098 868.6863 877.1972 891.8882 928.6536 948.6432 952.4354 954.9879 962.1263 993.3155 996.1972 1002.4845 1006.5596 1011.4900 1023.9562 1030.6115 1041.6826 1048.2204 1055.2893 1057.5539 1066.2431 1078.5284 1087.4913 1139.5358 1157.5141 1159.3259 1168.8205 1185.6971 1192.0733 1193.3147 1230.1668 1239.3172 1248.2248 1255.0670 1258.8746 1263.1045 1271.2663 1272.6875 1288.8157 1291.7375 1294.8748 1303.4882 1313.7638 1323.7318 1337.2412 1344.1139 1355.1020 1362.0389 1378.8631 1381.2914 1399.5970 1400.8166 1410.1354 1419.1285 1423.0143 1432.0349 1448.9584 1456.3989 1467.1367 1485.9466 1490.1047 1501.1608 1504.6057 1521.7787 1559.5840 1564.2227 1594.6105 1597.5565 1611.1027 1619.9917 2708.4100 2796.3770 3012.2079 3013.0160 3020.8809 3024.0974 3038.0293 3040.5425 3065.7271 3066.0281 3086.5148 3086.9894 3127.7265 3131.5407 3148.6294 3153.1355 3154.4232 3158.2944 3161.9316 3162.9926 3171.9789 3177.2148 3186.7049 3187.3553 3187.9601
redmass: 10.0379 6.7556 6.3545 6.5324 6.5423 5.8011 5.4729 5.5224 6.1464 6.1053 6.6434 6.4639 4.6349 3.2584 6.3842 4.5919 2.9204 4.9710 5.7046 4.8911 6.1320 5.2228 5.0020 4.9384 5.3837 7.1980 5.1903 5.9780 6.1959 5.7013 3.9527 4.6546 4.9821 5.7092 7.9168 6.2637 4.9423 4.5422 5.9340 4.2188 3.8017 3.9776 3.7811 8.4218 3.9813 4.9038 4.5036 4.8798 3.3972 5.6699 6.0124 6.0664 8.9612 12.2931 6.0852 5.8227 3.4086 5.3670 6.3155 4.9990 3.5023 4.1341 1.7646 4.3812 1.9823 1.4494 2.2302 2.8782 1.2169 1.4210 1.9024 1.6449 2.2046 1.5496 1.4098 1.3602 3.8592 2.1538 1.5325 1.1067 3.4800 1.3689 4.9129 5.2313 1.3505 1.3764 1.3430 5.1689 1.3704 4.4016 3.2201 4.3177 2.4551 2.7299 4.0672 3.8321 3.3969 1.5223 1.6815 1.5449 1.4760 1.4503 1.3882 1.1018 1.5882 1.1173 1.8720 1.2568 1.7996 1.6268 1.1959 1.5374 1.3732 1.2724 1.3912 1.2354 1.3627 1.1928 1.9557 1.9068 1.2493 1.2522 1.8190 1.9853 1.3151 1.3097 7.3083 2.7881 7.0837 1.1129 1.1143 2.2689 2.3695 2.5968 2.3634 1.0968 1.1123 1.1209 1.1114 2.9810 5.4726 6.3921 6.7581 7.2496 6.5999 6.4173 1.0739 1.0698 1.0609 1.0606 1.0599 1.0611 1.0570 1.0565 1.1026 1.1013 1.1051 1.1046 1.1102 1.1105 1.0894 1.0878 1.0909 1.0900 1.0899 1.0863 1.0955 1.0943 1.1007 1.0997 1.0963
irintensity: 0.0987 1.3622 0.8252 1.0323 0.9966 1.2396 0.0226 5.6793 1.6485 1.5373 0.1037 5.9910 1.1920 2.1176 0.1162 0.2916 0.1834 0.3034 2.8464 3.0821 12.5293 1.6215 6.2921 2.9937 1.9753 12.6862 3.1561 3.0449 1.0800 10.4396 2.0794 24.9563 12.0572 2.8794 22.2269 45.4056 13.7729 1.3170 8.5150 3.2508 1.2457 10.5456 2.4449 10.6901 24.5933 24.9078 16.1807 2.9494 0.6509 28.1717 19.9988 4.6387 41.6374 83.3309 13.8690 1.4884 34.9652 16.5373 6.2468 10.8334 5.8354 2.6401 80.1080 4.4205 48.3289 62.4697 27.5615 23.5911 22.0721 12.5385 31.7452 172.7850 65.0675 24.1487 53.6397 0.9662 1.9818 9.6812 18.5604 111.3267 0.2831 0.8675 7.9533 162.4457 1.3797 5.4691 0.1612 1.6853 0.2986 8.3664 2.6770 13.5327 1.0362 21.2784 1.3088 1.7740 25.3289 4.1145 25.6795 3.5512 23.6360 52.7455 8.3956 20.9120 60.2969 6.3341 18.8426 144.1323 21.4473 16.7637 47.1620 88.8880 48.2488 8.5602 19.8148 40.8455 6.0909 33.6360 24.4098 60.7920 58.2908 11.3413 79.5562 20.6429 16.0158 23.2398 3.8843 52.6499 4.2083 10.6174 7.6472 18.1405 2.3743 54.6124 0.9726 14.0799 29.0650 4.6800 61.3323 5.2608 1750.2237 0.3241 61.6696 2.0221 209.1408 8.0903 41.8563 1487.2557 3.1768 3.1286 20.9224 15.6110 5.1316 4.6531 0.6824 1.0533 13.7626 2.5339 0.8116 0.5458 1.7002 2.0818 1.4545 0.6335 1.3716 2.2820 3.5057 9.6021 6.8268 6.4437 0.4615
temp: 298.150 k
press: 1.00000 atm
elementType: 16 16 16 8 8 8 8 8 8 7 7 6 6 6 6 6 6 6 6 6 6 6 6 6 6 6 6 6 6 6 6 6 6 6 1 1 1 1 1 1 1 1 1 1 1 1 1 1 1 1 1 1 1 1 1 1 1 1 1
symmnumber: 1
zpe: 1171186.8 jmol-1
zpe.correction: 0.446081 hartree
zpe.thermalcorrener: 0.478541 hartree
zpe.thermalcorrenthalpy: 0.479485 hartree
zpe.thermalcorrgfe: 0.382048 hartree
zpe.sumelectzpe: -2643.451913 hartree
zpe.sumelectthermal: -2643.419453 hartree
zpe.sumelectthermalent: -2643.418509 hartree
zpe.sumelectthermalfe: -2643.515946 hartree
dipole: -6.4653 -14.9150 0.7009
dipole: 16.2711
quadrupole: -132.7560 -206.2954 -222.3971
quadrupole: -24.2849 9.7836 -5.4882
quadrupole: 54.3935 -19.1459 -35.2476 -24.2849 9.7836 -5.4882
hfenergy: -2643.8979942 hartree
pointgroup: C01 [X(C23H25N2O6S3)]
dipole: -3.2830582 5.4862361 -0.3199203 debye
polarizability: 636.2450413|123.7520663|451.6807397|8.8257105|2.3863434|193.0946307 unknown
InChI: InChI=1S/C23H25N2O6S3/c26-33(27,28)15-5-13-24-19(12-11-18-7-1-2-8-20(18)24)17-23-25(14-6-16-34(29,30)31)21-9-3-4-10-22(21)32-23/h1-4,7-12,17,26,29H,5-6,13-16H2
charge 1 multiplicity 1
59 atoms
S  0.082229 3.814528 0.576921
S  0.324065 -4.620256 -0.001465
S  3.977765 -2.861891 0.112452
O  1.405056 -5.294533 1.262127
O  3.855389 -4.179138 -1.102691
O  1.237258 -3.908967 -1.182966
O  -0.759534 -5.725166 -0.409694
O  2.827912 -3.091477 1.278866
O  5.508033 -2.693583 0.547708
N  -2.537102 -0.014691 0.232675
N  1.862802 2.093555 -0.357856
C  -1.840491 -1.095301 0.986145
C  2.451898 0.935239 -1.066927
C  -1.803434 1.107523 -0.177432
C  0.509999 2.161758 -0.056271
C  -1.327365 -2.269969 0.108072
C  3.041061 -0.147785 -0.119787
C  -3.941436 -0.11154 0.047168
C  2.62319 3.259184 -0.065338
C  -0.370328 1.068238 -0.134465
C  1.826081 4.322507 0.428732
C  -4.657281 1.030023 -0.46067
C  -0.493116 -3.191908 0.999319
C  3.389976 -1.373471 -0.964861
C  -2.536912 2.239658 -0.678673
C  -3.91421 2.209679 -0.804284
C  4.014071 3.434105 -0.235309
C  -4.66232 -1.29666 0.362823
C  2.373464 5.574781 0.749174
C  -6.072443 0.957986 -0.625148
C  4.572765 4.688753 0.088497
C  -6.056072 -1.337262 0.191574
C  3.766088 5.748724 0.573754
C  -6.77107 -0.209693 -0.299518
H  -0.99648 -0.623951 1.519523
H  -2.532153 -1.469975 1.758835
H  3.234276 1.319864 -1.743983
H  1.662946 0.498084 -1.705311
H  -2.173794 -2.82044 -0.339594
H  -0.712017 -1.890366 -0.72864
H  3.932953 0.242447 0.40185
H  2.300346 -0.419607 0.654741
H  0.106995 0.086667 -0.181131
H  -1.075141 -3.742799 1.756346
H  0.384038 -2.701898 1.45442
H  2.521777 -1.803543 -1.49121
H  4.242231 -1.231898 -1.649313
H  -1.972441 3.110007 -1.018286
H  -4.448856 3.076699 -1.206232
H  4.655853 2.626435 -0.59922
H  -4.158107 -2.195561 0.723592
H  1.751684 6.391252 1.126938
H  -6.602118 1.834684 -1.013153
H  5.649079 4.841796 -0.034417
H  -6.596075 -2.257674 0.435025
H  4.222856 6.711529 0.820304
H  -7.856018 -0.262288 -0.425628
H  2.833248 -4.292027 -1.273009
H  2.130333 -4.559288 1.415903
