program: Gaussian 09
title: 000102899
version: EM64L-G09RevD.01
frameworkgroup: C1[X(C8H10Cl4O2)]
method: RPBEPBE
basis: SDD
operation: Freq
keyword: #p
keyword: freq=noraman
keyword: PBEPBE/SDD
title: #p freq=noraman PBEPBE/SDD
converged: YES YES NO NO
title: Mulliken charges:
elementType: Cl Cl Cl Cl O O C C C C C C C C H H H H H H H H H H
charge: 0.022993 0.021034 0.097096 0.049480 -0.255717 -0.181291 -0.367388 -0.346855 -0.261166 -0.684572 -0.622325 0.363257 0.368484 -0.440794 0.210664 0.212715 0.199295 0.198319 0.233094 0.228536 0.213848 0.212573 0.221262 0.307457
chargesum: 0.00000
title: Mulliken charges with hydrogens summed into heavy atoms:
elementType: Cl Cl Cl Cl O O C C C C C C C C
charge: 0.022993 0.021034 0.097096 0.049480 -0.255717 -0.181291 0.055991 0.050759 0.200465 -0.036889 -0.314868 0.363257 0.368484 -0.440794
polarizability: 1.32848545e+02 3.85225512e+00 1.48005091e+02 6.72753942e+00 2.81399015e+00 1.19549826e+02
1716.lowfreq: -13.0037 -3.2746 -0.0032 -0.0025 0.0010 3.4560 11.6155 22.7166 37.7780
frequency: 3.7495 22.6458 37.5563 41.2607 63.1904 71.5102 103.8580 109.2654 125.1268 146.0017 176.2346 189.7464 225.9176 236.2365 238.8697 266.4850 314.8808 348.2507 360.8686 406.6531 439.8663 501.4485 544.1392 627.7333 685.5284 725.7093 739.2688 775.2264 796.7173 835.4100 876.0575 909.3177 930.3122 942.5793 1039.6528 1077.1210 1122.0844 1124.6669 1126.7512 1146.7582 1191.5977 1212.2679 1263.5573 1271.2115 1273.9131 1287.1179 1343.9402 1370.8393 1394.3265 1468.2657 1471.6831 1478.6230 1479.8346 1489.9940 1614.0223 1668.4615 2972.0951 2978.5136 2995.5051 3007.0420 3015.9232 3050.4589 3074.1125 3079.6531 3083.9732 3084.3263
redmass: 3.6727 9.6033 3.3040 6.9731 3.2162 11.2542 3.8589 2.6581 9.2962 14.9386 4.4062 9.8558 6.5352 1.1675 6.3486 11.1539 21.4925 12.0563 21.3133 3.1739 5.9583 9.9885 11.2836 8.2840 7.1636 8.0014 1.0704 8.6535 1.1441 9.8296 6.4631 1.9477 1.1814 7.1870 3.3719 2.2969 4.0549 4.1355 2.7544 1.5001 1.3337 1.3456 1.3525 1.2854 1.1729 1.0809 1.4324 1.5110 1.2133 1.0823 1.0682 1.0440 1.0601 1.0899 11.2276 11.8280 1.0587 1.0365 1.0599 1.0566 1.1005 1.1036 1.1023 1.0994 1.0918 1.0993
irintensity: 0.0396 0.0331 0.1160 0.9947 0.2698 0.0713 0.2616 0.1317 0.8182 0.3200 5.1611 0.2962 3.7279 0.2562 0.5945 3.8741 0.4975 0.8476 1.3861 9.8634 4.8521 13.4752 10.2267 50.4617 32.3240 37.1811 9.8304 48.4843 0.1598 65.5726 40.6120 0.5826 2.2499 89.6808 30.5734 36.4474 22.5263 185.3490 134.7275 6.3732 35.4396 0.6449 31.1546 7.4670 2.3781 0.2737 0.5449 9.6154 7.8936 0.7692 0.2998 12.3650 6.9452 19.1261 31.1000 202.8759 28.4232 29.0555 14.4736 34.4865 7.1810 2.9382 22.4627 46.4890 32.8846 61.1004
temp: 298.150 k
press: 1.00000 atm
elementType: 17 17 17 17 8 8 6 6 6 6 6 6 6 6 1 1 1 1 1 1 1 1 1 1
symmnumber: 1
zpe: 437091.0 jmol-1
zpe.correction: 0.166479 hartree
zpe.thermalcorrener: 0.183704 hartree
zpe.thermalcorrenthalpy: 0.184648 hartree
zpe.thermalcorrgfe: 0.115223 hartree
zpe.sumelectzpe: -2300.406659 hartree
zpe.sumelectthermal: -2300.389435 hartree
zpe.sumelectthermalent: -2300.388491 hartree
zpe.sumelectthermalfe: -2300.457915 hartree
dipole: 3.0207 -2.5537 -1.1077
dipole: 4.1076
quadrupole: -100.8517 -121.9647 -107.1204
quadrupole: 1.2291 0.4623 -2.2381
quadrupole: 9.1272 -11.9858 2.8585 1.2291 0.4623 -2.2381
hfenergy: -2300.5731386 hartree
pointgroup: C01 [X(C8H10Cl4O2)]
dipole: -1.273693 -0.9129066 0.3949629 debye
dipolederiv: -0.2940589 -0.3154153 -0.0016185 -0.0938942 -0.5292672 -0.0186593 0.0424391 -0.0350032 -0.0964496 -0.0461016 0.0601388 -0.0616752 0.0586952 -0.0948706 0.034739 -0.0783683 0.0858528 -0.5471846 0.0072967 0.1918811 0.0497701 0.2393858 -0.5664258 -0.2220469 0.0953962 -0.3383152 -0.2607324 -0.0119576 0.0731995 -0.0812757 0.0847723 -0.1462657 0.0267626 -0.1161716 0.0971639 -0.7029528 -1.7076065 -0.3840675 -0.0096817 -0.5002941 -0.6700689 0.0526863 -0.0357321 0.046643 -0.2608081 -0.6277564 0.2404843 -0.0304199 -0.1745426 -0.9109909 0.0705461 0.0132196 0.1799672 -0.2851163 -0.1409973 -0.055284 -0.0235569 -0.0221255 0.0205571 0.0009043 -0.0508184 0.0054473 0.1371749 0.1265331 -0.0228746 -0.0096154 -0.1361903 0.0486136 0.0123787 0.0145114 0.0208846 0.1761981 1.0085091 0.1086209 0.0162723 0.0448697 0.2441451 0.0363807 0.0872041 0.0500484 0.3293507 -0.0356371 -0.0648986 -0.005736 -0.0140165 0.0246909 0.0037701 -0.019004 -0.0014497 0.0894195 0.2360752 0.4039707 -0.0369426 0.3828315 0.6874492 0.0434492 -0.2304368 0.2034684 -0.0391076 1.5839535 -0.05571 0.0023402 0.4248068 1.2329548 -0.164979 0.0241873 -0.2595011 0.2416892 -0.1429991 0.1084754 0.0549688 -0.075741 -0.2568647 -0.0491228 0.1086883 -0.1701043 0.6085257 0.010022 -0.3711608 0.0446872 -0.3694293 0.895846 0.1906827 0.0447595 0.1854178 1.0193736 0.0661188 0.008734 -0.0203702 -0.0074833 0.027217 0.0756377 -0.0289695 0.0888556 -0.1071348 0.0417567 0.0536884 0.043114 0.0454452 -0.0400196 -0.0842595 0.0656535 -0.0955137 -0.0121757 0.0395049 -0.0184597 0.0051221 0.0077178 0.0040327 0.1049375 -0.0316113 0.1189711 -0.1310042 0.0115174 0.0336354 0.0305663 0.0651431 -0.0786171 -0.1109672 0.0587576 -0.1334147 -0.0269353 -0.0440778 -0.0265996 0.015124 0.0240159 0.0399399 0.0538358 -0.03111 0.0618732 -0.0744744 -0.0680914 0.0104791 0.0146699 0.060267 -0.0249339 -0.0754794 0.015773 -0.0983155 -0.0155756 0.0649391 0.0724658 0.0804992 0.0157473 -0.051308 -0.1002302 0.0531484 -0.123651 -0.0245135 0.0964309 0.0088397 -0.0406218 -0.0266779 0.0203135 0.0784305 0.0048751 0.1163232 -0.1301113 -0.2131191 -0.0028334 -0.050048 0.0213607 0.0633659 0.0119475 -0.0573891 0.0063184 0.0927775 0.0397455 -0.0573095 0.0144277 -0.0546635 0.060507 0.0286557 0.050998 -0.0119664 0.0197669 unknown
polarizability: 131.8398544|-2.5246869|148.4058081|7.0221168|-3.684017|120.1577993 unknown
InChI: InChI=1S/C8H10Cl4O2/c1-2-3-4-14-8(13)6(10)5(9)7(11)12/h6H,2-4H2,1H3
charge 0 multiplicity 1
24 atoms
Cl 2.89086 2.213526 0.306197
Cl 1.705016 -0.182712 -2.046783
Cl 2.803896 -2.942031 -0.686474
Cl 2.638995 -1.693002 2.051237
O  -0.757116 0.474728 0.316502
O  -0.074292 2.658025 -0.153947
C  -3.004613 -0.442678 0.099097
C  -4.499094 -0.176412 -0.205688
C  -2.180536 0.839623 0.007844
C  -5.347347 -1.464255 -0.137244
C  1.562615 0.89236 0.529402
C  0.180808 1.486126 0.168851
C  1.912838 -0.334456 -0.253235
C  2.384609 -1.49475 0.273731
H  -2.900743 -0.87691 1.111805
H  -2.602529 -1.186368 -0.615048
H  -4.596097 0.27748 -1.212636
H  -4.897111 0.567988 0.513304
H  -2.207002 1.289424 -1.001577
H  -2.502419 1.603396 0.739772
H  -4.993553 -2.21169 -0.871597
H  -5.289255 -1.925302 0.866429
H  -6.41073 -1.255355 -0.352553
H  1.571803 0.663245 1.606511
