program: Gaussian 09
title: 000102888
version: EM64L-G09RevD.01
frameworkgroup: C1[X(C6H9N3)]
method: RPBEPBE
basis: SDD
operation: Freq
keyword: #p
keyword: freq=noraman
keyword: PBEPBE/SDD
title: #p freq=noraman PBEPBE/SDD
converged: YES YES NO NO
title: Mulliken charges:
elementType: N N N C C C C C C H H H H H H H H H
charge: -0.330590 -0.010367 -0.004651 -0.104840 -0.075401 -0.685249 -0.704434 -0.175402 -0.144004 0.282834 0.262378 0.276912 0.234675 0.250715 0.216995 0.241833 0.222602 0.245995
chargesum: 0.00000
title: Mulliken charges with hydrogens summed into heavy atoms:
elementType: N N N C C C C C C
charge: -0.053678 -0.010367 -0.004651 0.177994 0.186978 0.017135 0.005996 -0.175402 -0.144004
polarizability: 8.38455029e+01 -5.77523710e+00 7.74667015e+01 -5.46628218e-01 -2.03784569e-01 7.07585042e+01
1716.lowfreq: -16.1324 -0.0008 -0.0004 -0.0001 5.3499 7.0420 40.3120 75.4712 105.2795
frequency: 40.2416 75.4425 105.2761 189.7772 197.1293 205.9221 216.3055 251.9991 275.6518 364.4216 369.2978 517.3352 536.3118 554.3549 590.0714 642.9649 780.2902 786.1544 907.7013 969.6089 1037.1991 1070.4019 1076.8779 1106.4075 1153.8566 1179.4376 1278.1476 1294.1651 1314.4830 1332.9882 1391.4785 1393.1862 1444.5337 1468.6989 1475.0163 1475.8218 1480.4656 2166.0114 2195.9608 2886.1065 2998.5015 2998.9626 3006.4286 3097.3801 3099.3196 3118.8086 3119.0760 3460.0257
redmass: 6.2275 4.5706 5.6085 4.2786 2.5927 1.3035 1.7756 1.7283 2.4654 3.4106 4.0814 3.7339 4.4556 1.7990 5.6325 4.5204 2.7798 3.0075 1.6202 2.0659 1.9216 1.7109 2.1744 2.5534 3.4364 2.1474 1.2518 1.3095 1.2308 1.3175 1.1992 1.1941 1.1682 1.0442 1.0542 1.0507 1.0799 12.5173 12.5498 1.0808 1.0366 1.0403 1.0787 1.0990 1.0997 1.1013 1.1015 1.0751
irintensity: 4.9107 10.4061 0.6968 2.4164 2.0213 0.0270 2.5343 2.1618 2.6567 0.1179 3.9182 12.3166 12.3716 84.9375 3.6792 18.2871 5.6947 8.9701 1.7000 5.6135 1.4674 30.3692 5.8178 2.8561 100.8836 9.6833 0.4013 1.5746 16.1850 21.9771 21.2695 11.8720 6.4175 25.0143 9.2900 8.4956 0.7331 2.3354 1.1297 29.9572 16.4143 12.4778 5.6048 19.3562 23.1239 12.8098 14.9843 2.2747
temp: 298.150 k
press: 1.00000 atm
elementType: 7 7 7 6 6 6 6 6 6 1 1 1 1 1 1 1 1 1
symmnumber: 1
zpe: 375005.4 jmol-1
zpe.correction: 0.142832 hartree
zpe.thermalcorrener: 0.153277 hartree
zpe.thermalcorrenthalpy: 0.154221 hartree
zpe.thermalcorrgfe: 0.106614 hartree
zpe.sumelectzpe: -397.558889 hartree
zpe.sumelectthermal: -397.548444 hartree
zpe.sumelectthermalent: -397.547500 hartree
zpe.sumelectthermalfe: -397.595107 hartree
dipole: 0.2502 -1.0049 3.9586
dipole: 4.0918
quadrupole: -60.8954 -58.4016 -57.5963
quadrupole: 14.5354 1.4778 -2.3101
quadrupole: -1.9310 0.5628 1.3682 14.5354 1.4778 -2.3101
hfenergy: -397.7017211 hartree
pointgroup: C01 [X(C6H9N3)]
dipole: -0.1081188 1.5759969 -0.3101192 debye
dipolederiv: -0.67312 -0.1211956 0.0276458 -0.0992749 -0.4549989 -0.1650044 0.1084346 -0.2352783 -0.4946588 -0.2330786 -0.0290418 -0.005801 -0.0341983 -0.2455011 0.0067897 -0.1303262 -0.085611 -0.2349066 -0.2285719 0.0163518 -0.004028 0.0088829 -0.2269711 0.0068838 -0.0095227 0.0110176 -0.2143876 0.5877392 0.1835518 0.0389326 0.2990885 0.371234 0.0024607 -0.0874624 0.0150113 0.4086607 0.6673461 -0.1444837 0.0038334 -0.2386862 0.3857195 0.1395759 0.0002567 0.129706 0.3558315 -0.0573085 -0.0391099 -0.0043104 -0.0202806 0.0514693 -0.0448297 0.0209732 -0.0590269 0.0255597 -0.0713693 0.025813 -0.0103926 0.029328 0.0492073 0.0128299 0.0503296 0.0120731 0.0380009 -0.1984936 0.0165416 0.0929578 -0.032891 -0.101423 0.0413288 0.1455638 0.0578049 -0.0595354 -0.096712 -0.0391989 0.0630354 -0.0136566 -0.0437447 -0.0713214 0.0332972 -0.008771 -0.0386194 0.0494636 0.0222608 -0.0608276 -0.0058696 -0.0210147 0.040062 -0.0436028 0.0273339 0.0305443 -0.0060972 -0.0234542 -0.0479711 0.0662374 -0.0780779 -0.0874532 0.0151472 -0.0673801 -0.0461445 0.0941176 0.1085144 -0.0293793 0.0350115 0.2121234 0.0913098 -0.0083312 0.1681342 0.1232133 -0.044837 -0.0564661 0.0811595 -0.0874711 0.0286569 0.0569972 0.0795425 0.0292849 0.0794925 0.0594491 -0.040763 -0.0844339 -0.0261759 0.0330527 -0.0969184 -0.0652018 -0.081152 -0.0102878 0.070973 0.0501478 -0.0194081 0.079645 -0.01403 0.062151 -0.0509625 0.1254969 -0.0229172 -0.0387412 0.0571386 0.0732591 0.0828799 0.0394171 -0.0522988 0.0802368 -0.02396 0.0822067 0.0259658 0.0536923 -0.0963691 0.030039 0.0181036 0.1071621 -0.0833202 0.0929882 -0.0282929 0.0932747 -0.0402991 -0.0179024 -0.072608 -0.0032224 -0.049725 -0.0550517 -0.1076716 0.0062405 unknown
polarizability: 84.4762832|0.1547874|70.7943066|5.3968618|-0.5817355|76.8001188 unknown
InChI: InChI=1S/C6H9N3/c1-5(3-7)9-6(2)4-8/h5-6,9H,1-2H3
charge 0 multiplicity 1
18 atoms
N  0.007147 0.971985 0.031498
N  -2.373247 -1.179842 -1.361694
N  2.391499 -1.218949 1.286221
C  -1.1250 0.200743 0.58668
C  1.110254 0.198799 -0.592233
C  -2.101964 1.138725 1.330079
C  2.086893 1.162474 -1.30756
C  -1.845866 -0.585831 -0.469378
C  1.820767 -0.580998 0.455811
H  -0.711587 -0.527396 1.311356
H  0.735014 -0.543112 -1.338831
H  -0.301702 1.744139 -0.574141
H  -2.930414 0.56446 1.777221
H  -1.552549 1.664349 2.12799
H  -2.535327 1.887089 0.642412
H  2.936115 0.606938 -1.737374
H  1.56343 1.682143 -2.130743
H  2.473636 1.911784 -0.597314
