program: Gaussian 09
title: 000102892
version: EM64L-G09RevD.01
frameworkgroup: C1[X(C11H18N2O2)]
method: RPBEPBE
basis: SDD
operation: Freq
keyword: #p
keyword: freq=noraman
keyword: PBEPBE/SDD
title: #p freq=noraman PBEPBE/SDD
converged: YES YES NO NO
title: Mulliken charges:
elementType: O O N N C C C C C C C C C C C H H H H H H H H H H H H H H H H H H
charge: -0.269609 -0.261611 -0.166735 -0.351030 -0.137678 -0.451276 -0.340102 -0.467902 -0.190887 0.132610 0.136087 -0.395874 -0.040677 -0.697336 -0.714948 0.257092 0.241178 0.246415 0.248388 0.243134 0.245821 0.221953 0.239025 0.211584 0.231425 0.331627 0.206899 0.207002 0.225613 0.214243 0.196105 0.221924 0.227541
chargesum: 0.00000
title: Mulliken charges with hydrogens summed into heavy atoms:
elementType: O O N N C C C C C C C C C C C
charge: -0.269609 -0.261611 -0.166735 -0.019403 0.119413 0.036318 0.151420 -0.006924 0.054933 0.132610 0.136087 0.047135 0.166221 -0.050478 -0.069378
polarizability: 1.62184874e+02 -7.28868547e+00 1.37091078e+02 -5.76749279e+00 2.21839359e+00 9.87251337e+01
1716.lowfreq: -7.6736 -2.1616 -0.0010 -0.0008 -0.0008 11.2860 28.6378 37.8958 70.5936
frequency: 28.1330 37.5579 70.5128 86.1399 118.6602 142.9828 176.1626 187.0543 230.3791 233.7561 247.9903 295.6188 318.2247 334.2212 365.6644 408.9640 414.6769 446.1027 480.4751 501.2265 573.3005 596.8692 617.2113 668.5267 691.7253 742.0888 760.8256 800.8138 846.3587 858.9209 889.0833 901.5056 915.2562 925.7503 944.7042 966.1423 971.3363 995.4763 1024.6627 1059.4378 1072.1482 1116.3672 1123.0332 1131.6660 1151.5767 1174.9703 1192.6721 1194.0764 1218.8717 1232.5496 1236.6322 1269.3487 1269.5597 1293.0338 1309.5369 1312.8468 1314.1253 1335.1363 1337.7430 1353.4774 1378.0661 1383.6991 1395.6279 1401.5912 1428.7379 1447.4582 1466.7896 1469.4880 1475.8840 1479.4156 1484.4205 1493.4050 1497.6865 1604.5853 1628.9700 2926.9836 2960.4323 2965.3486 2975.7604 2981.5411 3001.8452 3012.2351 3031.2876 3034.6601 3046.3554 3053.2438 3059.6065 3067.6816 3073.3949 3078.8326 3088.6924 3111.2641 3523.6245
redmass: 4.0375 3.2345 4.1950 3.1583 3.8845 3.3961 2.6234 2.6078 2.2709 1.3108 4.1798 1.0419 3.7300 4.3587 2.1624 2.5684 3.4682 7.9998 3.9836 2.9176 2.9654 1.8360 3.4539 2.1234 3.6985 3.6502 3.0769 3.3767 1.9473 2.2654 1.4934 3.0166 1.3638 2.1783 1.7032 1.8522 2.1665 1.9634 2.4264 1.8864 2.3479 2.0659 2.1009 2.1325 1.9508 1.7083 1.8365 1.8594 1.3527 1.2423 1.3790 1.2736 1.3282 1.5006 1.4866 1.3570 1.4382 1.5152 1.5664 1.3905 1.6205 1.3324 1.8252 1.8561 2.7623 1.0845 1.0474 1.0865 1.0918 1.0539 1.0511 1.0856 1.0594 9.6084 6.4425 1.0821 1.0711 1.0428 1.0374 1.0651 1.0604 1.0668 1.0639 1.0931 1.0935 1.0970 1.1018 1.0982 1.1002 1.0997 1.1010 1.1035 1.0762
irintensity: 2.0551 0.3783 1.1151 0.8923 2.2810 1.4255 1.1080 0.0366 5.2681 0.9782 2.3897 0.0727 5.5230 17.7416 0.3779 1.7390 7.0506 0.7329 3.0114 5.2658 3.3426 28.1805 2.0252 66.2699 42.7753 11.2149 3.6723 0.8151 1.8211 8.5665 0.9027 7.3814 3.8724 3.4761 1.0887 0.9531 2.1139 13.9532 9.2022 9.8276 0.9260 2.2660 1.8467 21.9740 7.7262 6.6525 8.1780 5.5530 2.7102 5.5494 81.4964 13.0956 2.8029 30.3458 0.1704 2.0412 9.8027 0.8495 5.3493 28.4471 24.2568 12.5263 148.1725 50.4463 9.4820 4.0144 2.1221 11.0208 7.2313 6.1576 22.6673 3.9269 17.7013 269.8586 376.7421 25.9316 8.5430 32.5416 32.3204 22.6780 22.8520 31.9359 13.3020 6.4318 21.1022 38.7807 20.6066 75.9450 38.3221 45.6067 31.4025 26.6328 21.2095
temp: 298.150 k
press: 1.00000 atm
elementType: 8 8 7 7 6 6 6 6 6 6 6 6 6 6 6 1 1 1 1 1 1 1 1 1 1 1 1 1 1 1 1 1 1
symmnumber: 1
zpe: 738948.2 jmol-1
zpe.correction: 0.281450 hartree
zpe.thermalcorrener: 0.296463 hartree
zpe.thermalcorrenthalpy: 0.297407 hartree
zpe.thermalcorrgfe: 0.238660 hartree
zpe.sumelectzpe: -688.779213 hartree
zpe.sumelectthermal: -688.764201 hartree
zpe.sumelectthermalent: -688.763257 hartree
zpe.sumelectthermalfe: -688.822004 hartree
dipole: 0.2747 -0.1350 1.9106
dipole: 1.9349
quadrupole: -74.6432 -113.8381 -88.3539
quadrupole: 7.7654 -2.2794 -2.0041
quadrupole: 17.6352 -21.5597 3.9245 7.7654 -2.2794 -2.0041
hfenergy: -689.0606635 hartree
pointgroup: C01 [X(C11H18N2O2)]
dipole: 0.1031727 0.0642775 -0.7514977 debye
polarizability: 161.6891335|8.102538|137.5798083|5.5180603|2.7706926|98.7321446 unknown
InChI: InChI=1S/C11H18N2O2/c1-7(2)6-8-11(15)13-5-3-4-9(13)10(14)12-8/h7-9,12H,3-6H2,1-2H3
charge 0 multiplicity 1
33 atoms
O  -0.153819 2.373842 0.68544
O  -0.964038 -2.996025 0.362282
N  -1.464354 0.606884 -0.068653
N  0.501078 -1.203445 0.621542
C  -1.642332 -0.802748 -0.506358
C  -3.143121 -1.060105 -0.241138
C  -2.750091 1.353974 -0.038435
C  -3.783475 0.318041 -0.555926
C  0.929731 0.194744 0.37404
C  -0.278534 1.154493 0.347295
C  -0.684874 -1.769921 0.201736
C  1.789182 0.366374 -0.920127
C  3.310781 0.0747 -0.767579
C  4.018141 1.15475 0.086962
C  3.622184 -1.344358 -0.231525
H  -1.444589 -0.888975 -1.598276
H  -3.287565 -1.336113 0.818249
H  -3.536342 -1.87994 -0.861248
H  -2.686902 2.261797 -0.663338
H  -2.956948 1.679996 0.998108
H  1.526332 0.523242 1.24379
H  -3.921724 0.432038 -1.646937
H  -4.767852 0.445751 -0.076613
H  1.360217 -0.284397 -1.708184
H  1.677767 1.414474 -1.260108
H  1.170414 -1.845909 1.0543
H  3.731131 0.137966 -1.793681
H  3.650498 1.157653 1.130683
H  3.851719 2.166119 -0.326472
H  5.108015 0.972569 0.123043
H  3.357775 -1.438292 0.840734
H  4.704026 -1.558106 -0.309376
H  3.07877 -2.125673 -0.794429
