program: Gaussian 09
title: 000102893
version: EM64L-G09RevD.01
frameworkgroup: C1[X(C13H26O2)]
method: RPBEPBE
basis: SDD
operation: Freq
keyword: #pfreq=noraman
keyword: PBEPBE/SDD
title: #p freq=noraman PBEPBE/SDD
converged: YES YES NO NO
title: Mulliken charges:
elementType: O O C C C C C C C C C C C C C H H H H H H H H H H H H H H H H H H H H H H H H H H
charge: -0.418635 -0.236698 -0.387738 -0.382340 -0.385196 -0.384046 -0.382156 -0.401504 -0.372816 -0.132781 -0.353265 -0.356766 -0.715546 0.160987 -0.696733 0.196745 0.192435 0.199230 0.189227 0.194676 0.192103 0.187438 0.217119 0.192703 0.191552 0.221406 0.196305 0.189738 0.188963 0.237989 0.187773 0.187394 0.194519 0.194930 0.227407 0.223712 0.235153 0.209779 0.209446 0.214780 0.372712
chargesum: 0.00000
title: Mulliken charges with hydrogens summed into heavy atoms:
elementType: O O C C C C C C C C C C C C C
charge: -0.045923 -0.236698 0.001442 0.006117 0.001582 0.020511 0.002099 0.016207 0.005885 0.105208 0.021902 0.032683 -0.029274 0.160987 -0.062729
polarizability: 1.86179329e+02 5.55519170e-01 1.34240482e+02 4.35843374e+00 -7.23110481e-01 1.24818008e+02
1716.lowfreq: -3.5001 -0.0011 -0.0009 0.0009 3.9572 8.5903 18.9376 19.9311 34.0001
frequency: 18.7547 19.8520 33.8462 36.0525 49.6674 73.4758 82.6703 94.6148 115.5695 124.2174 146.1717 153.6433 157.2747 176.2556 201.4705 222.9363 233.9684 253.6494 270.1029 335.4925 342.3338 426.3953 455.2118 494.8251 508.9032 578.7073 613.9671 714.6406 720.1231 722.6834 729.1066 742.0127 763.2161 794.5137 844.8819 888.4060 900.5038 917.8375 959.8638 984.0397 990.0404 1002.5355 1021.3581 1031.3669 1033.8365 1043.9833 1058.9657 1074.6056 1080.3565 1081.8844 1092.0066 1109.1663 1125.7172 1158.0892 1184.4468 1208.9258 1212.2737 1237.9143 1241.7690 1248.4620 1267.7299 1271.2148 1279.2391 1287.6058 1289.5708 1290.4638 1298.5497 1301.1820 1311.1292 1333.6351 1349.8076 1354.0873 1357.7704 1358.7006 1362.6187 1386.2206 1388.6593 1453.7753 1459.5940 1460.3154 1463.3274 1464.5886 1469.0398 1472.0715 1474.8731 1477.5815 1480.2021 1481.6052 1485.7154 1488.7389 1661.0699 2948.9486 2949.1782 2950.9341 2952.0145 2955.4779 2959.5626 2963.6547 2967.6068 2971.3105 2977.7884 2981.7035 2986.0161 2986.4806 2992.4673 3000.9244 3009.9507 3014.9333 3022.2333 3031.8560 3040.5461 3050.4190 3067.7672 3070.1486 3087.4854 3093.0758 3504.1561
redmass: 4.0495 8.6234 3.2656 1.9882 3.4942 1.6967 3.1883 3.0426 1.7165 2.5879 2.3340 1.9764 2.5522 3.3377 1.0816 3.3449 1.1253 3.2692 2.9923 3.2485 3.9518 3.0596 3.4617 3.0156 3.1255 3.3274 1.2538 2.8036 1.0653 1.1208 1.2545 1.4439 1.4881 1.3229 1.2623 1.9017 1.2998 1.7906 1.2690 4.8429 3.5162 1.4227 2.5219 1.8654 1.6399 2.8391 2.8677 2.6559 2.0771 2.2252 2.5116 1.5534 2.6437 2.0831 1.8119 1.3156 1.5056 1.4453 1.3167 1.4468 1.2746 1.2666 1.0213 1.2048 1.1699 1.1244 1.1017 1.1204 1.3471 1.4078 1.4856 1.6891 1.6112 1.5770 1.6648 1.2526 1.2174 1.0788 1.0743 1.0719 1.0637 1.0769 1.0813 1.0473 1.0822 1.0425 1.0764 1.0726 1.0916 1.0933 8.0897 1.0585 1.0585 1.0591 1.0592 1.0595 1.0598 1.0595 1.0585 1.0365 1.0611 1.0956 1.0913 1.0398 1.0981 1.1001 1.0986 1.0913 1.1015 1.1039 1.1043 1.1033 1.1006 1.0993 1.1004 1.1007 1.0638
irintensity: 0.0011 1.6021 0.2982 0.0517 0.2014 0.0423 0.2207 0.0150 0.0256 0.1130 0.0359 0.0021 0.0634 0.1049 0.1893 0.1235 0.0011 0.5090 2.8109 0.7284 2.6071 1.4788 6.6976 3.8930 16.2978 6.4689 119.3306 32.6873 19.0546 2.4083 14.3556 2.9353 2.5904 0.4196 0.3225 4.7702 0.6259 0.2405 2.2567 1.4727 7.4793 9.9090 0.0401 130.9413 78.5297 90.2700 7.4520 1.1425 0.2339 0.5387 11.3683 11.7435 3.6139 6.8156 0.9096 12.7288 1.2312 1.6724 0.4241 3.8315 1.7417 2.0851 0.3011 1.3795 1.3564 0.4763 0.4796 0.5727 1.3245 0.4297 1.5362 0.2146 0.5800 0.4882 15.4928 16.2966 10.9463 3.4778 0.0189 0.2157 0.0997 0.3910 0.1688 16.4478 2.7684 11.9545 2.9927 12.5929 4.7381 33.7149 188.4560 0.0497 0.0637 0.1814 1.6561 1.0521 2.9600 82.7111 184.1087 36.6522 40.4405 2.2827 1.6668 36.2089 2.2588 0.7489 0.3776 8.2392 3.8683 1.2078 152.1005 126.0555 98.0641 55.9203 34.2847 29.1627 17.8259
temp: 298.150 k
press: 1.00000 atm
elementType: 8 8 6 6 6 6 6 6 6 6 6 6 6 6 6 1 1 1 1 1 1 1 1 1 1 1 1 1 1 1 1 1 1 1 1 1 1 1 1 1 1
symmnumber: 1
zpe: 962736.0 jmol-1
zpe.correction: 0.366687 hartree
zpe.thermalcorrener: 0.386440 hartree
zpe.thermalcorrenthalpy: 0.387384 hartree
zpe.thermalcorrgfe: 0.314571 hartree
zpe.sumelectzpe: -660.196465 hartree
zpe.sumelectthermal: -660.176712 hartree
zpe.sumelectthermalent: -660.175768 hartree
zpe.sumelectthermalfe: -660.248580 hartree
dipole: -0.4168 -0.7031 -1.2278
dipole: 1.4750
quadrupole: -92.0535 -91.5088 -99.9874
quadrupole: 0.4083 4.4120 -0.5466
quadrupole: 2.4631 3.0078 -5.4709 0.4083 4.4120 -0.5466
hfenergy: -660.5631515 hartree
pointgroup: C01 [X(C13H26O2)]
dipole: 0.1635132 0.251127 -0.4969555 debye
polarizability: 186.1607161|0.1959957|134.2883199|-4.5184718|0.2490879|124.7887825 unknown
InChI: InChI=1S/C13H26O2/c1-3-4-5-6-7-8-9-10-11-12(2)13(14)15/h12,14H,3-11H2,1-2H3
charge 0 multiplicity 1
41 atoms
O  5.643578 -1.738038 -0.605647
O  4.5304 -1.274292 1.37511
C  -0.581078 -0.005501 -0.32061
C  0.66259 0.8052 0.107927
C  -1.9107 0.607046 0.17376
C  1.991855 0.186814 -0.379679
C  -3.155238 -0.203541 -0.253081
C  3.226856 1.008609 0.052135
C  -4.48472 0.40625 0.245639
C  4.57279 0.426754 -0.440648
C  -5.729507 -0.405414 -0.178584
C  -7.058797 0.203163 0.323471
C  5.761661 1.388542 -0.149098
C  4.867855 -0.910697 0.226482
C  -8.296497 -0.61627 -0.101946
H  -0.490509 -1.043007 0.063734
H  -0.603731 -0.085431 -1.427846
H  0.683784 0.885776 1.214621
H  0.574333 1.842619 -0.278555
H  -1.887419 0.685904 1.280919
H  -2.00137 1.645407 -0.209193
H  1.972114 0.100154 -1.486507
H  2.07863 -0.843843 0.019623
H  -3.063263 -1.242357 0.127927
H  -3.180347 -0.280777 -1.360442
H  3.253948 1.079145 1.157169
H  3.135387 2.042517 -0.337704
H  -4.45871 0.484161 1.352926
H  -4.57768 1.444931 -0.135917
H  4.531294 0.247145 -1.531688
H  -5.637211 -1.444602 0.201612
H  -5.758542 -0.482263 -1.285923
H  -7.151466 1.240559 -0.058503
H  -7.027961 0.28167 1.429573
H  5.841531 1.591728 0.934088
H  5.597029 2.348904 -0.669121
H  6.718516 0.96384 -0.499419
H  -8.243074 -1.648239 0.293833
H  -8.366404 -0.684377 -1.204202
H  -9.233155 -0.160138 0.268441
H  5.853625 -2.581854 -0.119378
