program: Gaussian 09
title: 000102939
version: EM64L-G09RevD.01
frameworkgroup: C1[X(C18H28N2O2)]
method: RPBEPBE
basis: SDD
operation: Freq
keyword: #p
keyword: freq=noraman
keyword: PBEPBE/SDD
title: #p freq=noraman PBEPBE/SDD
converged: NO YES NO NO
title: Mulliken charges:
elementType: O O N N C C C C C C C C C C C C C C C C C C H H H H H H H H H H H H H H H H H H H H H H H H H H H H
charge: -0.245814 -0.257028 -0.089177 -0.614742 0.162259 -0.051056 -0.510161 -0.406663 0.321788 -0.398508 0.115106 -0.805855 -0.346010 -0.330948 -0.727987 -0.364222 -0.371333 -0.321761 -0.326831 -0.264391 -0.263238 -0.245223 0.240510 0.209459 0.233584 0.192445 0.258645 0.222569 0.201219 0.228702 0.242131 0.225606 0.189796 0.215369 0.202099 0.189443 0.226547 0.212874 0.212288 0.253694 0.225363 0.191067 0.213449 0.212924 0.190241 0.326769 0.337986 0.229681 0.226088 0.231244
chargesum: 0.00000
title: Mulliken charges with hydrogens summed into heavy atoms:
elementType: O O N N C C C C C C C C C C C C C C C C C C
charge: -0.245814 -0.257028 -0.089177 0.050013 0.162259 0.189454 -0.067118 0.044426 0.321788 0.025281 0.115106 -0.109414 0.059155 0.060594 -0.076277 -0.110529 -0.145969 0.082756 0.076334 -0.034710 -0.037149 -0.013979
polarizability: 2.39108051e+02 1.83482940e+01 1.94709113e+02 5.84402896e-01 1.59037548e+01 1.92000109e+02
1716.lowfreq: -8.4965 -3.9374 -0.0008 -0.0006 -0.0003 1.0560 12.3395 29.1338 41.8635
frequency: 5.6915 29.0408 41.2559 47.5240 60.4369 70.0576 87.3236 90.6792 118.4508 141.3182 154.6233 173.4966 208.0486 225.4546 232.2580 239.8435 255.1906 262.1897 284.4477 312.4403 315.8491 325.9648 347.1212 361.1765 389.1597 405.0662 408.2703 426.5983 445.6686 469.3407 474.8624 528.5899 534.9667 581.9404 590.5537 595.5084 617.0649 624.5062 680.7464 707.9719 739.5082 753.9832 770.5013 776.2871 783.9142 807.8713 838.1963 842.2796 855.7808 884.4630 902.2640 910.4616 934.0561 964.5674 979.9011 988.5241 990.9887 996.5761 999.4822 1027.3753 1030.4000 1033.8948 1039.6431 1052.2009 1059.2646 1063.5932 1075.6634 1091.4828 1096.4087 1097.5378 1115.2240 1128.9672 1143.6508 1159.3566 1171.2111 1174.9272 1185.9597 1189.7940 1202.3873 1225.4605 1255.7108 1262.8934 1269.2323 1288.7572 1293.8479 1304.7560 1310.4236 1325.4264 1328.2420 1329.8100 1334.9398 1345.2310 1350.3877 1363.2798 1370.7987 1373.8794 1386.2328 1392.8835 1397.5643 1432.5956 1443.1016 1446.7256 1451.8324 1458.3694 1465.8619 1467.8821 1473.3667 1479.2005 1482.4055 1486.3960 1487.1690 1503.6767 1573.2155 1585.4128 1609.6715 1624.1156 2851.7055 2861.3623 2876.1279 2951.9427 2956.9123 2968.6258 2976.3391 2986.9445 2992.4181 3001.3375 3024.3885 3029.8081 3034.1467 3041.0809 3065.7945 3066.6467 3078.4251 3078.5154 3082.2974 3082.7847 3092.1802 3123.1776 3131.2024 3146.8935 3155.7836 3166.9669 3508.4165 3663.1458
redmass: 2.9953 4.0457 3.9874 4.6814 3.0620 3.1813 4.4994 2.3797 3.8518 5.6573 3.6201 3.4491 3.5952 1.4972 1.6069 2.1636 3.0799 2.0019 1.7973 2.6454 3.0964 2.7442 2.1162 4.3935 2.2978 2.7814 2.8800 2.9431 3.5107 2.8353 3.2936 2.0129 1.2301 2.2799 2.7101 2.0954 4.4001 2.2338 3.8474 1.6827 4.6489 1.8054 2.0579 1.6715 1.6475 3.7498 1.8326 1.7370 1.2575 2.6119 2.4647 1.6844 1.6593 1.1866 1.3831 2.2572 5.1441 1.3093 2.7308 2.1774 2.3029 2.5958 2.5470 2.2126 2.1013 2.7501 2.2703 3.3053 1.8488 1.9707 2.3541 2.6901 2.5709 2.6129 2.2415 1.0670 2.4997 1.0724 1.1460 1.2325 1.3596 1.3984 1.3248 1.3754 1.5248 1.2985 1.2407 1.5595 1.5656 1.4162 1.3276 1.2943 1.3895 1.5576 1.3663 3.0163 1.2232 1.1983 1.4130 2.2617 1.0824 1.0791 1.0976 1.0966 1.0686 1.0835 1.0587 1.0658 1.2704 1.3885 1.1707 1.0521 1.9890 4.4679 5.4755 2.5225 1.0708 1.0702 1.0693 1.0665 1.0665 1.0585 1.0375 1.0429 1.0759 1.0596 1.0997 1.0890 1.0896 1.0883 1.0996 1.0993 1.0985 1.0965 1.0977 1.0986 1.0988 1.0846 1.0882 1.0927 1.0946 1.0999 1.0444 1.1044
irintensity: 0.1721 0.4038 1.9866 0.4568 0.0090 3.5250 1.8495 3.4558 0.8334 0.9634 2.4203 3.1644 1.7052 0.9846 3.7799 0.9063 1.2313 4.3352 1.1016 7.3754 1.8787 3.7961 0.6134 5.0716 2.1258 1.2542 0.5380 2.0903 5.9718 0.6251 5.0983 4.0155 190.7297 18.6216 2.7170 15.9667 6.5499 44.6213 3.6826 49.3699 11.4577 8.1107 3.0829 35.2133 3.4644 23.1734 0.2614 0.2071 0.8715 7.0269 5.0845 3.4540 1.8810 8.2460 0.5944 0.8996 0.5623 0.1254 32.5452 10.3829 9.6406 2.7423 9.3938 23.4703 1.3688 5.4481 21.1514 30.1652 10.2832 11.0134 4.5849 65.1566 8.5673 3.7196 3.0770 0.1359 0.2052 1.8209 2.0773 14.8360 9.0267 6.7387 2.7658 14.6331 38.4467 18.8466 5.9730 20.0835 24.6202 10.0154 14.6571 8.0640 7.8772 1.3694 2.7926 1.1729 12.8799 22.8518 4.5113 5.8460 2.3801 0.4890 22.1419 3.4899 1.8282 0.5682 5.7658 17.2266 27.8583 9.3783 7.4307 7.1138 92.5542 3.4981 27.2789 214.4627 47.9585 46.6606 146.2702 37.9425 98.8625 27.1492 34.8419 21.7665 6.6280 18.3014 31.3241 38.7680 42.4503 0.9749 50.9067 23.6735 62.5549 40.5886 39.3974 37.9601 22.6068 1.8726 4.6260 25.2459 35.3921 12.7059 29.2035 32.6442
temp: 298.150 k
press: 1.00000 atm
elementType: 8 8 7 7 6 6 6 6 6 6 6 6 6 6 6 6 6 6 6 6 6 6 1 1 1 1 1 1 1 1 1 1 1 1 1 1 1 1 1 1 1 1 1 1 1 1 1 1 1 1
symmnumber: 1
zpe: 1134690.1 jmol-1
zpe.correction: 0.432181 hartree
zpe.thermalcorrener: 0.454965 hartree
zpe.thermalcorrenthalpy: 0.455909 hartree
zpe.thermalcorrgfe: 0.378126 hartree
zpe.sumelectzpe: -960.937980 hartree
zpe.sumelectthermal: -960.915196 hartree
zpe.sumelectthermalent: -960.914251 hartree
zpe.sumelectthermalfe: -960.992034 hartree
dipole: -2.6371 -2.7783 -0.3958
dipole: 3.8510
quadrupole: -144.0634 -134.9491 -128.8911
quadrupole: 7.3349 2.3137 -5.4439
quadrupole: -8.0955 1.0187 7.0768 7.3349 2.3137 -5.4439
hfenergy: -961.3701603 hartree
pointgroup: C01 [X(C18H28N2O2)]
dipole: -1.0775813 0.8681149 -0.617006 debye
polarizability: 240.4145381|-12.8255838|208.5894874|10.6667283|-0.0444599|176.8132466 unknown
InChI: InChI=1S/C18H28N2O2/c1-3-15(2)18(17(19)21,16-7-5-4-6-8-16)9-10-20-11-13-22-14-12-20/h4-8,15H,3,9-14,19H2,1-2H3
charge 0 multiplicity 1
50 atoms
O  5.723843 1.05011 -0.15183
O  -0.444662 -2.878137 -0.76829
N  2.977319 0.103882 -0.382945
N  -1.075204 -1.372173 -2.397704
C  -0.892867 -0.53137 -0.04761
C  -1.018822 -1.153807 1.410233
C  0.479763 0.224545 -0.223296
C  1.746448 -0.622367 0.028336
C  -2.080902 0.414127 -0.355663
C  -0.832476 -0.0867 2.523983
C  -0.818539 -1.70641 -1.080106
C  -2.325452 -1.956098 1.621503
C  4.134643 -0.817177 -0.543744
C  3.341533 1.208275 0.542831
C  -0.830308 -0.671966 3.954748
C  -3.34138 -0.118744 -0.753374
C  -1.991548 1.824221 -0.204031
C  5.354771 -0.043694 -1.067465
C  4.576503 1.956886 0.014229
C  -4.455955 0.714434 -0.985886
C  -3.105029 2.663805 -0.436384
C  -4.345452 2.115063 -0.828214
H  -0.189075 -1.88465 1.482771
H  0.493765 1.095647 0.454115
H  0.544871 0.622518 -1.253594
H  1.801313 -0.929852 1.102686
H  1.694665 -1.553363 -0.56384
H  -1.631545 0.677339 2.441084
H  0.128646 0.443266 2.375614
H  -2.271535 -2.521934 2.567993
H  -2.473817 -2.695428 0.816353
H  -3.210421 -1.295909 1.673234
H  4.406006 -1.310916 0.423854
H  3.862313 -1.609928 -1.265782
H  2.499945 1.920958 0.619964
H  3.559404 0.81907 1.570895
H  -1.818222 -1.076057 4.236936
H  -0.566874 0.106824 4.694268
H  -0.09108 -1.490483 4.048766
H  -3.452399 -1.200067 -0.886728
H  -1.047559 2.288807 0.095213
H  5.127403 0.371963 -2.073015
H  6.244425 -0.692467 -1.125264
H  4.911323 2.727405 0.728581
H  4.330201 2.431012 -0.960711
H  -0.956527 -2.091688 -3.110594
H  -1.440174 -0.457134 -2.658643
H  -5.41004 0.268779 -1.28954
H  -2.999354 3.747464 -0.310744
H  -5.208787 2.764922 -1.008991
