program: Gaussian 09
title: 000102938
version: EM64L-G09RevD.01
frameworkgroup: C1[X(C17H17N3O5)]
method: RPBEPBE
basis: SDD
operation: Freq
keyword: #p
keyword: freq=noraman
keyword: PBEPBE/SDD
title: #p freq=noraman PBEPBE/SDD
converged: YES YES NO NO
title: Mulliken charges:
elementType: O O O O O N N N C C C C C C C C C C C C C C C C C H H H H H H H H H H H H H H H H H
charge: -0.257752 -0.425633 -0.289289 -0.216313 -0.211413 -0.406259 -0.434952 0.020901 -0.178310 -0.603627 0.446062 0.133019 -0.364545 -0.412175 0.506765 0.249006 -0.346959 -0.393475 0.276449 -0.419831 -0.315341 -0.775884 -0.348800 -0.363675 0.393048 0.293186 0.230110 0.281112 0.347654 0.282493 0.247729 0.346951 0.259069 0.229242 0.244612 0.315871 0.220601 0.252695 0.254411 0.287575 0.287802 0.357872
chargesum: 0.00000
title: Mulliken charges with hydrogens summed into heavy atoms:
elementType: O O O O O N N N C C C C C C C C C C C C C C C C C
charge: -0.257752 -0.067761 -0.289289 -0.216313 -0.211413 -0.058605 -0.088001 0.020901 0.114876 -0.092405 0.446062 0.133019 -0.082052 -0.164446 0.506765 0.249006 -0.087890 -0.164232 0.276449 -0.175219 0.000529 -0.048176 -0.061225 -0.075873 0.393048
polarizability: 3.32223468e+02 -2.66579923e+01 2.65552059e+02 -1.70667554e+01 -2.03991769e+01 1.28646549e+02
1716.lowfreq: -6.5554 -4.5129 -0.0007 -0.0006 0.0005 0.9942 15.0765 22.8375 26.8916
frequency: 14.7732 22.7433 26.8381 43.7517 54.5654 60.1321 69.7920 74.2951 79.0441 94.3103 102.4292 122.4804 145.2581 174.9515 194.0058 208.2364 253.4021 291.9633 305.3108 318.5235 333.2615 348.4582 366.3105 390.4620 398.8765 408.9607 414.3980 417.2909 460.4256 503.3502 507.2804 509.5579 530.9035 592.0271 616.5013 622.1766 634.3317 642.4372 651.2848 668.1847 668.7599 689.2767 716.3338 723.4797 741.8505 768.4421 774.1503 809.0406 829.9070 832.8238 843.5037 848.4493 880.7719 883.3455 929.0350 941.6347 974.5183 981.3861 983.2197 995.2933 1000.3866 1004.3782 1009.6741 1011.4844 1044.3785 1095.7550 1097.0516 1118.6233 1140.6724 1142.3775 1157.8140 1178.8707 1180.6491 1187.8165 1213.0056 1224.6203 1238.6147 1251.5980 1273.4153 1286.5364 1300.1179 1308.1393 1327.0090 1349.5999 1360.1471 1389.2668 1390.7512 1396.6474 1426.6650 1428.1691 1450.4728 1454.7383 1462.6491 1478.2843 1487.6918 1503.9256 1527.9896 1588.0416 1590.6635 1599.1701 1613.5051 1622.2254 1627.6968 2983.1612 2998.6739 3009.6425 3072.0454 3097.2313 3104.6479 3112.6234 3125.2136 3131.3224 3136.2600 3172.7503 3178.7226 3185.8720 3203.0010 3441.1325 3491.7542 3579.9765
redmass: 6.5207 7.0738 5.8763 4.8150 4.7971 5.8303 3.1137 2.7865 2.1886 7.2329 3.0602 6.4632 6.4954 6.4662 6.4219 7.5489 5.1696 3.6893 5.6753 4.0418 5.0276 5.6302 1.1124 4.1715 5.8283 3.4255 3.2128 3.1057 4.5665 3.1959 5.1899 4.6234 3.3871 2.9813 6.5076 6.2541 6.3593 5.1438 1.9720 2.9106 2.6497 1.3276 3.6709 3.4567 4.0774 4.6949 6.6299 1.5101 3.6054 4.6813 1.3753 1.5843 1.5223 3.4288 2.9397 1.6268 1.9612 1.3752 1.3442 2.1097 3.1036 2.7789 3.0498 1.3988 1.6517 3.0829 1.4467 1.2995 1.6575 3.0588 1.1491 1.5294 1.1237 2.1382 2.3159 4.2725 1.6207 2.8602 1.9770 1.6139 1.3992 1.3077 1.3432 1.7478 3.8633 5.6294 1.2387 6.2985 2.9756 4.4963 1.0558 1.2615 1.1553 1.7725 2.5533 2.7250 2.3540 6.6018 7.3536 6.3675 4.6213 5.8958 4.7722 1.0814 1.0359 1.0609 1.1036 1.0981 1.1009 1.0875 1.0915 1.0913 1.0965 1.0949 1.0907 1.0946 1.0959 1.0776 1.0780 1.0661
irintensity: 0.1369 0.3823 2.9598 1.9113 2.3681 1.5811 0.8193 1.4776 1.3824 14.1855 1.2159 1.3246 10.2556 7.0554 0.8280 2.4328 11.4230 2.5435 3.4775 1.4632 0.9663 0.0149 139.7532 7.7340 16.7135 16.0399 4.6038 1.3140 17.2826 34.5253 8.4461 6.5050 13.6799 33.5633 4.7985 3.4784 2.4670 5.7837 62.4264 59.1009 3.5511 53.5120 0.2655 19.3219 13.2180 17.7233 14.1263 45.3915 4.6609 0.9076 12.4423 28.0320 70.6506 42.1662 7.5681 17.4865 1.3291 1.9957 1.6181 0.1672 0.2513 3.5624 16.9352 2.6718 13.6237 25.0711 44.6400 17.8987 217.4233 49.4937 3.0090 283.4255 13.4884 12.1674 8.5354 460.0945 4.9295 32.7673 55.9583 11.1655 39.8234 21.2843 23.1182 20.9605 84.1838 13.2610 74.7641 274.1064 21.9054 32.7662 21.8410 206.2854 82.5932 349.2377 23.3316 88.9319 340.6629 10.5571 219.9588 115.4297 112.2435 94.8829 32.8049 21.8729 10.2078 20.4585 4.8452 9.0592 16.2267 13.3758 1.6064 9.4334 10.2448 3.6989 1.9236 2.6996 3.3894 179.7664 104.9721 46.2339
temp: 298.150 k
press: 1.00000 atm
elementType: 8 8 8 8 8 7 7 7 6 6 6 6 6 6 6 6 6 6 6 6 6 6 6 6 6 1 1 1 1 1 1 1 1 1 1 1 1 1 1 1 1 1
symmnumber: 1
zpe: 837707.9 jmol-1
zpe.correction: 0.319066 hartree
zpe.thermalcorrener: 0.342444 hartree
zpe.thermalcorrenthalpy: 0.343388 hartree
zpe.thermalcorrgfe: 0.262481 hartree
zpe.sumelectzpe: -1196.540158 hartree
zpe.sumelectthermal: -1196.516780 hartree
zpe.sumelectthermalent: -1196.515836 hartree
zpe.sumelectthermalfe: -1196.596744 hartree
dipole: 4.0716 1.2803 2.0317
dipole: 4.7271
quadrupole: -206.4844 -129.5158 -144.9249
quadrupole: -16.7719 3.5595 5.0421
quadrupole: -46.1760 30.7925 15.3835 -16.7719 3.5595 5.0421
hfenergy: -1196.8592245 hartree
pointgroup: C01 [X(C17H17N3O5)]
dipole: 1.6539365 -0.3593597 -0.7707793 debye
polarizability: 325.1015589|34.6184831|270.1539721|18.8109615|-25.425611|131.1665445 unknown
InChI: InChI=1S/C17H17N3O5/c1-11(21)18-16(10-12-2-8-15(22)9-3-12)17(23)19-13-4-6-14(7-5-13)20(24)25/h2-9,16,18-19,22H,10H2,1H3
charge 0 multiplicity 1
42 atoms
O  0.089096 2.824308 -0.480025
O  1.961166 -5.042584 0.839832
O  4.694632 1.959154 0.762772
O  -6.305699 -1.374662 0.367306
O  -6.633797 0.830105 -0.126663
N  2.737589 2.736245 -0.197724
N  -0.220167 0.570801 0.121606
N  -5.868192 -0.182551 0.118155
C  2.074098 1.445942 -0.027533
C  2.597952 0.368413 -1.053355
C  2.390146 -1.063366 -0.582758
C  0.556243 1.691788 -0.150129
C  3.09794 -1.538502 0.559198
C  1.521362 -1.960474 -1.253798
C  -1.629533 0.441626 0.099545
C  4.034666 2.917713 0.243248
C  2.940087 -2.859049 1.017491
C  1.353267 -3.291988 -0.80652
C  2.066013 -3.738438 0.332384
C  -2.165203 -0.850906 0.37192
C  -2.506814 1.531149 -0.167965
C  4.615444 4.313456 0.064632
C  -3.551164 -1.06043 0.379918
C  -3.896318 1.320548 -0.159518
C  -4.407494 0.032347 0.112674
H  2.312539 1.06638 0.986884
H  2.131699 0.54202 -2.040432
H  3.680039 0.56494 -1.150636
H  2.151473 3.506962 -0.536892
H  3.796476 -0.864573 1.071021
H  0.978436 -1.623723 -2.145454
H  0.305614 -0.292654 0.306992
H  3.489238 -3.232013 1.886861
H  0.685182 -3.973572 -1.348991
H  -1.486772 -1.68782 0.576697
H  -2.089416 2.51678 -0.377613
H  3.895037 5.035535 -0.355724
H  5.495113 4.258969 -0.600118
H  4.968958 4.68447 1.041789
H  -3.982884 -2.042601 0.587425
H  -4.591997 2.139456 -0.360525
H  1.362242 -5.598498 0.281825
